program: Gaussian 09
title: 000270883
version: EM64L-G09RevD.01
frameworkgroup: C1[X(C17H19NO)]
method: RPBEPBE
basis: SDD
operation: Freq
keyword: #p
keyword: freq=noraman
keyword: PBEPBE/SDD
title: #p freq=noraman PBEPBE/SDD
converged: YES YES NO NO
title: Mulliken charges:
elementType: O N C C C C C C C C C C C C C C C C C H H H H H H H H H H H H H H H H H H H
charge: -0.268755 0.020210 0.161378 -0.027094 -0.510907 0.156455 -0.432110 -0.500828 -0.409354 -0.098545 0.135232 0.302316 0.182643 0.159710 -0.561972 -0.861791 -0.499656 -0.844647 -0.483164 0.227478 0.223097 0.210770 0.210112 0.235322 0.228846 0.213687 0.213227 0.233816 0.224720 0.232468 0.263980 0.243037 0.229553 0.217946 0.267174 0.233089 0.232981 0.239575
chargesum: 0.00000
title: Mulliken charges with hydrogens summed into heavy atoms:
elementType: O N C C C C C C C C C C C C C C C C C
charge: -0.268755 0.020210 0.161378 -0.027094 -0.060332 0.156455 -0.011228 -0.036660 0.017560 -0.098545 0.135232 0.302316 0.182643 0.159710 -0.103436 -0.122306 -0.052157 -0.111404 -0.243589
polarizability: 2.88773216e+02 4.42646630e+00 1.97840041e+02 -1.41398764e+00 2.40883546e+00 1.09692133e+02
1716.lowfreq: -8.8890 -0.0003 0.0002 0.0005 3.3199 5.8967 47.0779 75.5835 98.8304
frequency: 47.0529 75.5816 98.8268 115.2955 124.4001 127.2375 133.2170 155.2676 173.2886 236.2410 255.7481 268.0979 290.3273 309.8948 319.8475 335.4057 353.6436 369.4901 439.5936 456.9474 460.9213 490.4339 508.9790 538.9425 587.5715 615.4130 617.9100 631.7399 666.9026 672.5521 716.9496 754.3436 781.7939 818.7808 828.3837 839.7096 866.7538 890.8355 909.9011 916.8975 921.0337 965.3282 1002.3474 1007.5771 1033.9166 1034.7122 1055.2191 1058.2667 1066.3688 1074.0422 1081.8611 1086.8580 1102.7704 1130.6772 1142.4852 1175.3466 1187.9495 1219.8870 1229.6423 1234.4493 1250.3408 1271.0525 1305.6960 1310.4109 1330.8629 1337.7303 1348.6037 1350.6678 1361.2978 1369.7981 1391.7049 1398.2233 1401.8295 1415.9617 1447.4819 1455.2621 1457.6620 1465.3709 1467.3744 1470.2615 1470.8527 1475.3285 1480.8430 1482.4199 1489.9991 1573.1789 1595.4778 1618.5156 1632.0516 2948.9242 2959.2929 2960.4221 2967.8175 2979.6361 2981.3363 2983.4237 2988.0727 3019.6178 3027.6171 3044.6678 3046.5233 3049.3953 3052.5104 3053.7883 3056.6130 3088.6773 3103.0910 3122.6610
redmass: 3.7167 2.7796 1.8046 1.8268 1.6753 1.3156 2.4550 3.5531 2.5047 2.8814 2.9433 2.9050 3.1477 2.2345 2.9189 4.0774 4.3448 3.3590 4.0985 3.1610 4.3437 3.4397 4.2209 3.7120 4.1531 3.9757 5.2295 4.7828 3.0801 3.7432 4.0807 2.8307 4.2255 3.3117 1.4623 2.9429 2.6797 2.8364 1.5167 3.1159 1.6254 2.2324 2.4941 2.5223 1.5687 1.5431 2.1039 2.2696 1.9001 2.4915 2.5725 2.8562 2.9772 1.3772 1.4094 1.2415 2.1021 2.3119 1.2708 1.3435 1.6679 2.0883 1.4643 1.9403 1.4044 1.4854 1.5567 1.8121 1.6175 4.1879 3.2903 1.3562 1.2676 2.7035 1.0902 1.1166 1.1265 1.0917 1.0935 1.5056 1.4507 1.1545 1.1926 1.0607 1.2735 7.7777 7.5736 8.4435 7.7523 1.0697 1.0640 1.0651 1.0637 1.0389 1.0643 1.0413 1.0627 1.0946 1.0951 1.0918 1.0990 1.0950 1.0971 1.0968 1.1038 1.0886 1.0976 1.0935
irintensity: 0.1110 1.3519 0.3562 3.7853 0.1975 0.5211 0.3892 0.9550 2.7390 1.4799 0.5498 0.7787 0.7421 0.6714 1.4465 2.1238 2.9808 4.0920 3.2290 4.2421 0.3181 0.5653 3.9916 2.9999 4.9872 1.5539 2.7853 4.0825 6.7193 1.7423 2.2677 12.8097 3.5660 5.0040 7.2580 5.7326 8.4155 6.5643 0.8528 4.6237 8.2971 6.1934 8.2632 2.1458 2.8926 2.4962 3.2479 7.3280 6.0125 40.8921 26.7280 35.7983 5.6436 1.5857 5.0132 4.8815 14.6594 2.6745 7.9217 5.4119 3.8048 6.7520 9.0270 55.4669 2.2294 5.6162 7.9144 1.8947 7.9133 3.2029 9.3113 11.3166 19.4013 4.3055 11.6370 6.4763 5.3692 11.6625 10.4409 11.6487 5.6910 3.0963 12.1518 16.2467 11.1775 72.2863 13.6178 10.5981 14.9153 30.9686 31.9467 48.4179 37.1766 30.9481 31.7629 24.5187 32.4165 32.7162 18.4948 42.7932 74.3886 46.1963 15.6355 12.1476 62.3614 31.4566 7.3828 14.3084
temp: 298.150 k
press: 1.00000 atm
elementType: 8 7 6 6 6 6 6 6 6 6 6 6 6 6 6 6 6 6 6 1 1 1 1 1 1 1 1 1 1 1 1 1 1 1 1 1 1 1
symmnumber: 1
zpe: 834229.0 jmol-1
zpe.correction: 0.317741 hartree
zpe.thermalcorrener: 0.334442 hartree
zpe.thermalcorrenthalpy: 0.335386 hartree
zpe.thermalcorrgfe: 0.274285 hartree
zpe.sumelectzpe: -787.810523 hartree
zpe.sumelectthermal: -787.793822 hartree
zpe.sumelectthermalent: -787.792878 hartree
zpe.sumelectthermalfe: -787.853979 hartree
dipole: 3.7599 0.8450 0.0326
dipole: 3.8538
quadrupole: -112.6610 -108.5066 -113.2961
quadrupole: -13.4432 -0.1597 0.7800
quadrupole: -1.1731 2.9813 -1.8082 -13.4432 -0.1597 0.7800
hfenergy: -788.1282638 hartree
pointgroup: C01 [X(C17H19N1O1)]
dipole: -1.4867467 0.2971778 -0.0129799 debye
polarizability: 288.9289735|-2.2759608|197.6505966|-1.5312415|-2.9404145|109.7258193 unknown
InChI: InChI=1S/C17H19NO/c1-10-14-9-18-8-7-12(14)11(2)17-16(10)13-5-3-4-6-15(13)19-17/h9H,3-8H2,1-2H3
charge 0 multiplicity 1
38 atoms
O  -1.435786 1.75738 -0.037646
N  4.319599 -1.270891 -0.106947
C  -1.976331 -0.498565 -0.011074
C  -0.514428 -0.383303 0.041911
C  -2.907472 -1.693535 -0.039738
C  -2.475988 0.787469 -0.047758
C  -4.344637 -1.260022 -0.443261
C  -3.900645 1.238317 -0.081001
C  -4.801007 0.026702 0.290108
C  -0.233066 1.017523 0.013113
C  0.574774 -1.295592 0.11565
C  2.121289 0.683011 0.085178
C  1.04528 1.601928 0.039163
C  1.88906 -0.736196 0.123832
C  3.569731 1.147507 0.169815
C  0.354859 -2.79992 0.178177
C  4.520756 0.147547 -0.52394
C  1.224557 3.10785 0.02463
C  3.083377 -1.61431 0.176471
H  -2.545889 -2.455846 -0.756204
H  -2.929789 -2.184876 0.955264
H  -4.375631 -1.079154 -1.536437
H  -5.050264 -2.085548 -0.232383
H  -4.059008 2.076562 0.624174
H  -4.164944 1.619625 -1.088593
H  -4.754471 -0.140463 1.384196
H  -5.853008 0.256258 0.038798
H  3.858947 1.232779 1.239743
H  3.695255 2.152161 -0.271894
H  0.883053 -3.252937 1.037418
H  -0.710836 -3.045823 0.285305
H  0.727919 -3.305519 -0.732602
H  5.574252 0.410033 -0.322405
H  4.380972 0.190656 -1.625994
H  0.248087 3.616669 0.04656
H  1.812404 3.453891 0.894707
H  1.76051 3.442135 -0.883996
H  2.937619 -2.667999 0.453159
