program: Gaussian 09
title: 000025967
version: EM64L-G09RevD.01
frameworkgroup: C1[X(C5H7Cl2NO2S)]
method: RPBEPBE
basis: SDD
operation: Freq
keyword: #p
keyword: freq=noraman
keyword: PBEPBE/SDD
title: #p freq=noraman PBEPBE/SDD
converged: YES YES NO NO
title: Mulliken charges:
elementType: Cl Cl S O O N C C C C C H H H H H H H
charge: 0.019863 0.009541 0.265262 -0.431683 -0.201311 -0.627106 -0.109974 -0.657542 0.220605 -0.253440 -0.327751 0.241866 0.272675 0.311434 0.309775 0.283686 0.385039 0.289060
chargesum: 0.00000
title: Mulliken charges with hydrogens summed into heavy atoms:
elementType: Cl Cl S O O N C C C C C
charge: 0.019863 0.009541 0.265262 -0.046643 -0.201311 -0.033646 0.131892 -0.073432 0.220605 -0.253440 -0.038691
polarizability: 1.62563154e+02 -3.33073987e+00 9.15388793e+01 -1.14004682e+00 5.55649937e+00 6.86800521e+01
1716.lowfreq: -6.6181 -3.6472 -0.0017 0.0022 0.0028 5.2994 13.4288 26.9214 36.6500
frequency: 12.1837 26.8587 36.6436 59.4334 87.3948 157.6294 173.1018 213.8614 247.3043 250.9095 259.7861 296.9614 350.5628 390.9608 449.1370 494.6805 544.7761 549.3001 578.5498 629.0130 681.1194 722.2433 745.2617 768.1915 782.9641 838.0369 914.6085 1007.5254 1045.9739 1093.4143 1155.1817 1202.7268 1221.8225 1252.9554 1260.1411 1319.9273 1388.2134 1430.8313 1586.1906 1633.2121 1688.1107 2860.2173 3042.8474 3130.2727 3203.1813 3472.0351 3518.9774 3605.2336
redmass: 9.9184 12.0517 10.5559 6.3576 7.9458 13.3896 5.0485 5.2202 2.7459 2.2130 3.6082 2.3660 5.9733 9.0907 5.2526 4.5070 7.1627 4.2794 1.3166 1.4547 3.7381 4.1933 9.0370 1.3408 2.6304 7.1301 1.7666 3.4412 2.2620 1.9701 1.1799 1.5467 1.1272 1.1719 1.6719 1.3324 1.9241 1.0975 9.6739 1.0932 9.4120 1.0801 1.0575 1.1087 1.0941 1.0448 1.0641 1.0991
irintensity: 0.2224 0.0056 1.8136 0.5325 0.4108 1.1058 1.5547 0.7058 27.6846 10.9911 17.1620 21.3442 5.8123 21.9713 22.4425 29.0938 15.6926 18.9294 51.2742 296.5062 60.9751 13.9981 112.5140 41.5566 7.1710 77.9154 3.4079 83.2986 287.2807 24.3634 8.7706 1.1064 3.2669 10.5841 23.9364 10.2035 9.3520 26.3809 20.1800 51.8625 189.5936 57.6928 14.5998 2.6798 11.9311 7.0606 29.5543 6.8314
temp: 298.150 k
press: 1.00000 atm
elementType: 17 17 16 8 8 7 6 6 6 6 6 1 1 1 1 1 1 1
symmnumber: 1
zpe: 313304.8 jmol-1
zpe.correction: 0.119331 hartree
zpe.thermalcorrener: 0.132735 hartree
zpe.thermalcorrenthalpy: 0.133679 hartree
zpe.thermalcorrgfe: 0.075305 hartree
zpe.sumelectzpe: -1717.212888 hartree
zpe.sumelectthermal: -1717.199485 hartree
zpe.sumelectthermalent: -1717.198540 hartree
zpe.sumelectthermalfe: -1717.256915 hartree
dipole: 3.6773 -3.3694 -0.1671
dipole: 4.9903
quadrupole: -76.0971 -81.4665 -87.5357
quadrupole: 0.8050 -0.6071 -2.7701
quadrupole: 5.6027 0.2333 -5.8360 0.8050 -0.6071 -2.7701
hfenergy: -1717.3322196 hartree
pointgroup: C01 [X(C5H7Cl2N1O2S1)]
dipole: -1.3828822 1.2167756 -0.6795364 debye
dipolederiv: -0.1618228 0.0253425 -0.0464902 0.022343 -0.3299205 0.3510341 -0.1495006 0.3965455 -0.4570725 -0.8926669 0.002284 -0.1143209 0.1840981 -0.0433926 0.0624173 -0.3257841 0.0297434 -0.0782049 -0.3613445 0.1081982 -0.123356 -0.0221014 -0.1282403 0.1370475 0.0071062 0.127044 -0.0635828 -1.3041532 -0.0078301 -0.2823177 -0.1674917 -0.2947641 -0.0983051 -0.2910388 -0.062814 -0.4846818 -0.7376375 -0.0459727 -0.1170135 0.1562463 -0.7026182 0.2316449 -0.2169415 0.1471097 -0.3971066 -0.6902174 0.1446336 0.0939498 0.1630771 -0.4259796 -0.0492282 0.1114935 -0.0442012 -0.7262061 0.4393293 -0.1758398 -0.1772566 -0.1938984 0.1522515 0.147623 0.1181262 0.0408568 0.4256738 0.1912765 -0.0691814 -0.1474122 -0.1189703 0.1778967 0.0478249 -0.4033867 0.1199596 0.0496176 1.6026677 0.059015 0.4335826 0.1445774 0.9223945 -0.2631987 0.5133376 -0.2260369 0.4237512 0.3103914 -0.0407432 0.2085043 -0.0261371 0.3823878 -0.5487182 0.2091917 -0.6669204 0.5200077 0.9238665 -0.016977 0.1971137 -0.2183416 -0.1688287 -0.0874974 0.4163089 -0.0166315 -0.1120755 0.0151168 0.0316611 0.0471225 0.0092229 -0.0045482 -0.0254021 0.0724744 -0.0689787 -0.2186504 -0.0362048 -0.0088461 0.0364477 0.0094814 -0.1062351 -0.0565933 0.0831469 -0.0545065 0.0495152 0.0715364 0.0375341 0.0168546 0.0817278 0.067597 0.0385355 0.0155136 0.0039746 -0.0090227 0.0779146 0.006719 -0.0255385 0.0762258 0.2088119 -0.0713241 -0.1539075 -0.0129211 0.3186089 0.2041085 -0.0394023 0.0631603 -0.0753237 0.0467128 0.0125242 0.0767373 0.0810705 0.3155066 0.352086 -0.008051 -0.0122902 -0.046726 0.1214899 0.0816653 0.0084841 0.1003031 0.352578 -0.0042467 -0.0025439 -0.0507398 0.0219904 0.1249851 0.0899503 -0.0913613 0.1064031 0.0913443 unknown
polarizability: 162.0464304|-4.7583443|83.2538488|5.0762477|-12.6319442|77.4818067 unknown
InChI: InChI=1S/C5H7Cl2NO2S/c6-1-4(7)11-2-3(8)5(9)10/h1,3,9H,2,8H2
charge 0 multiplicity 1
18 atoms
Cl 2.196713 -1.297444 1.207438
Cl 5.036668 0.128568 0.174651
S  0.756184 0.152587 -1.136711
O  -3.751983 -0.579596 -0.504032
O  -1.902554 -1.519614 0.544293
N  -2.63505 1.822282 0.470912
C  -1.828752 0.840291 -0.280496
C  -0.370963 0.901895 0.209537
C  -2.434151 -0.546427 -0.018267
C  2.266924 -0.120823 -0.177964
C  3.424769 0.475933 -0.551825
H  -1.859207 0.994107 -1.388923
H  -0.052735 1.944255 0.369435
H  -0.237025 0.312622 1.12926
H  -3.645209 1.720674 0.335967
H  -2.308611 2.788346 0.382625
H  -4.155811 -1.469003 -0.312595
H  3.464594 1.215848 -1.352804
