program: Gaussian 09
title: 000270872
version: EM64L-G09RevD.01
frameworkgroup: C1[X(C9H10O2S)]
method: RPBEPBE
basis: SDD
operation: Freq
keyword: #p
keyword: freq=noraman
keyword: PBEPBE/SDD
title: #p freq=noraman PBEPBE/SDD
converged: YES YES NO NO
title: Mulliken charges:
elementType: S O O C C C C C C C C C H H H H H H H H H H
charge: 0.190755 -0.438148 -0.256587 -0.162946 0.237798 -0.284240 -0.237252 -0.601583 -0.340130 -0.202000 -0.661878 0.111336 0.281198 0.265688 0.265423 0.247012 0.276922 0.234560 0.232066 0.232230 0.225919 0.383855
chargesum: 0.00000
title: Mulliken charges with hydrogens summed into heavy atoms:
elementType: S O O C C C C C C C C C
charge: 0.190755 -0.054293 -0.256587 -0.162946 0.237798 -0.003042 0.009760 -0.070471 -0.063208 0.032560 0.028337 0.111336
polarizability: 1.75828351e+02 -5.65014883e+00 1.40212528e+02 -1.52122581e-01 8.10154145e-02 5.59836158e+01
1716.lowfreq: -4.0829 -2.4365 0.0013 0.0013 0.0018 5.7692 32.0858 63.2016 89.3111
frequency: 32.0766 63.1985 89.2935 90.1145 153.3577 184.1326 190.7318 234.7237 270.0409 307.3469 364.0722 416.7976 425.5870 483.8667 509.0929 593.3353 597.9452 635.5480 667.7550 681.0559 726.2646 797.2331 799.4369 812.4236 913.4614 935.3427 984.0207 991.6674 997.2348 1030.3499 1036.7529 1068.2348 1082.1250 1094.9743 1156.2506 1185.3683 1250.4136 1277.2578 1293.3000 1322.9306 1387.0327 1399.3480 1419.0331 1456.5942 1463.4551 1471.5086 1482.4691 1577.8087 1597.7585 1639.7945 2989.3670 3016.1549 3079.0591 3084.5903 3105.0143 3133.5944 3155.1678 3169.3476 3185.2348 3532.2406
redmass: 5.0431 9.1232 2.1684 3.2546 4.5543 5.8672 4.5557 1.1242 4.2308 5.0180 7.5031 3.0895 8.5035 3.3706 6.5849 4.7384 1.3158 4.6073 6.9321 2.8149 2.8995 7.0925 1.1190 1.6148 1.4012 1.4256 6.2075 1.3513 1.8020 4.1109 1.2108 2.3670 2.0854 1.6152 1.8418 1.1149 1.2207 1.2954 1.3745 2.1433 7.6875 1.2114 3.1635 1.4337 1.5356 1.0387 1.0479 6.4090 6.0980 8.6174 1.0354 1.0567 1.1044 1.0990 1.1056 1.0877 1.0945 1.0907 1.0962 1.0641
irintensity: 3.1866 0.2147 0.8116 1.1590 1.7199 0.7276 0.0189 0.1476 1.7485 1.1940 4.7305 5.5351 2.0009 3.0307 12.4359 54.9967 141.3572 0.8689 28.3552 0.0305 85.8736 40.3727 3.6003 33.3051 4.3846 5.5034 2.6727 0.5141 12.8124 210.9286 0.1782 0.1218 44.5481 2.0360 164.5067 8.7254 0.4707 15.8738 51.1782 90.8132 20.9915 20.1411 51.5333 19.2523 2.1290 15.9686 8.9735 63.2249 21.4381 225.7828 32.6729 13.7802 0.2733 22.0238 41.7898 4.6130 15.9205 1.3436 3.7182 45.6249
temp: 298.150 k
press: 1.00000 atm
elementType: 16 8 8 6 6 6 6 6 6 6 6 6 1 1 1 1 1 1 1 1 1 1
symmnumber: 1
zpe: 443154.7 jmol-1
zpe.correction: 0.168789 hartree
zpe.thermalcorrener: 0.180912 hartree
zpe.thermalcorrenthalpy: 0.181857 hartree
zpe.thermalcorrgfe: 0.129157 hartree
zpe.sumelectzpe: -896.593414 hartree
zpe.sumelectthermal: -896.581290 hartree
zpe.sumelectthermalent: -896.580346 hartree
zpe.sumelectthermalfe: -896.633046 hartree
dipole: 0.1431 0.3846 0.0211
dipole: 0.4109
quadrupole: -65.9942 -75.1092 -81.2277
quadrupole: -5.0084 0.0157 -0.0030
quadrupole: 8.1162 -0.9989 -7.1173 -5.0084 0.0157 -0.0030
hfenergy: -896.7622028 hartree
pointgroup: C01 [X(C9H10O2S1)]
dipole: 0.058815 -0.1476496 0.0295989 debye
dipolederiv: -0.6410174 -0.2450541 0.0496301 -0.206429 -0.1079236 -0.0047198 0.0365206 -0.0050297 -0.1017096 -1.4554808 0.0018597 -0.0255176 -0.0712938 -0.2827905 -0.0367204 -0.0078536 -0.0348054 -0.4166034 -0.6695243 0.0523383 -0.02111 0.0691203 -1.058176 0.1809657 -0.0254165 0.1807999 -0.374268 1.1972706 0.3005171 -0.0451724 0.1974008 -0.2515819 0.0523138 -0.0172223 0.0540488 -0.0806284 -0.2122996 0.3424567 -0.090009 0.4133345 -0.3004625 0.0868212 -0.1077041 0.0854027 -0.011306 -0.3690107 -0.2596604 0.0583859 0.1744473 0.002653 -0.0216979 -0.050689 -0.032135 -0.0958174 -0.3040791 -0.1373879 0.0299458 -0.2095007 0.0299232 -0.0397594 0.0481793 -0.0379699 -0.1003224 0.0403457 0.1387937 -0.0385759 0.2857464 0.3795098 -0.0494697 -0.0737988 -0.0524855 0.1708606 -0.1026044 0.0080558 -0.0006181 -0.1619344 -0.0409173 -0.0283051 0.0412886 -0.0243041 -0.1332366 -0.0035999 0.0929443 -0.0193104 0.0544197 0.1317903 -0.067529 -0.0099736 -0.0667786 -0.1315481 -0.0028533 -0.0032259 -0.0002087 -0.200372 -0.0371059 0.0223478 0.0499994 0.0258703 0.0600281 1.8550599 -0.2925851 0.1116549 -0.3544611 1.4156998 -0.3002621 0.127375 -0.2992081 0.3065769 0.1355261 -0.0406173 0.0095044 -0.0745702 0.0207671 0.0284791 0.0179261 0.0291756 0.1366563 0.0042346 0.0165022 -0.0944593 -0.055394 -0.0319251 0.0538863 -0.0769586 0.044281 -0.0640745 -0.0019329 0.0614292 0.075918 -0.0092213 -0.0812127 -0.0452863 0.0948588 -0.0324391 -0.0092059 0.0253176 0.1046437 -0.0289894 0.0786925 0.0304516 0.0322015 -0.0222732 0.0330828 0.14554 -0.0118639 -0.0321097 0.0035031 -0.0296409 0.118392 0.0116098 0.0026807 0.0115507 0.1653975 0.0467683 -0.0689939 0.0144711 -0.0626556 -0.0872233 0.0590318 0.0126622 0.0588 0.1435914 0.0427187 -0.0059284 -0.0642295 0.0663989 0.1138882 0.0470132 -0.1205522 0.0145232 -0.0880335 0.0372142 0.0280844 0.0619915 0.1192661 0.0431549 -0.11319 0.0766887 -0.0837189 -0.0118367 0.0150768 -0.057895 0.0127695 -0.0958613 -0.1326658 0.0632165 0.022553 0.0641848 0.1074478 0.3747338 -0.0041673 0.0004259 0.0725076 0.1257549 0.0690529 -0.0182903 0.0671543 0.3824918 unknown
polarizability: 175.5843928|6.6600101|135.5389197|1.0780011|-19.6541058|60.9011828 unknown
InChI: InChI=1S/C9H10O2S/c1-2-12-8-5-3-4-7(6-8)9(10)11/h3-6,10H,2H2,1H3
charge 0 multiplicity 1
22 atoms
S  2.883975 -0.76796 0.0425
O  -3.498377 0.635486 -0.459687
O  -1.775366 2.154367 -0.791641
C  1.063383 -0.959578 0.044924
C  -1.238743 -0.159541 -0.20843
C  0.158919 0.086521 -0.235244
C  0.559538 -2.25328 0.35253
C  3.110678 1.056478 -0.420821
C  -1.74236 -1.447672 0.097637
C  -0.831027 -2.489393 0.377388
C  4.614848 1.35894 -0.472922
C  -2.138859 0.984893 -0.512551
H  0.490631 1.100288 -0.476866
H  2.633374 1.222428 -1.401529
H  2.604077 1.670675 0.342916
H  1.256242 -3.070657 0.571084
H  -2.821854 -1.616727 0.112657
H  -1.200831 -3.492159 0.616004
H  5.096582 1.179617 0.504426
H  5.125013 0.738085 -1.230274
H  4.770742 2.419988 -0.740276
H  -4.040684 1.442002 -0.671025
