program: Gaussian 09
title: 000270857
version: EM64L-G09RevD.01
frameworkgroup: C1[X(C13H16N2O5)]
method: RPBEPBE
basis: SDD
operation: Freq
keyword: #p
keyword: freq=noraman
keyword: PBEPBE/SDD
title: #p freq=noraman PBEPBE/SDD
converged: YES YES NO NO
title: Mulliken charges:
elementType: O O O O O N N C C C C C C C C C C C C C H H H H H H H H H H H H H H H H
charge: -0.244721 -0.446415 -0.465502 -0.470681 -0.288428 -0.234938 -0.094592 -0.103775 -0.157106 -0.189937 -0.105434 -0.401311 0.336186 0.200413 -0.003542 -0.337657 -0.318971 -0.233741 -0.229231 -0.502470 0.236657 0.288633 0.256668 0.236921 0.281570 0.233307 0.362136 0.378388 0.233506 0.361332 0.246554 0.223452 0.224907 0.249786 0.227166 0.250869
chargesum: 0.00000
title: Mulliken charges with hydrogens summed into heavy atoms:
elementType: O O O O O N N C C C C C C C C C C C C C
charge: -0.244721 -0.084279 -0.087114 -0.109349 -0.288428 -0.234938 -0.094592 0.132882 0.131527 0.066731 0.131487 0.113566 0.336186 0.200413 -0.003542 -0.104151 -0.072417 -0.010288 -0.004325 0.225351
polarizability: 2.34365448e+02 1.63315265e+01 1.66922290e+02 6.19168469e+00 7.31284914e+00 1.09416479e+02
1716.lowfreq: -6.4812 -2.8961 -0.0009 -0.0007 -0.0003 8.1623 25.5180 49.6133 52.4534
frequency: 25.4496 49.5944 52.3953 61.1921 87.0402 120.0454 127.3924 156.1164 160.7651 176.9957 192.7759 207.4903 239.9174 255.3470 287.4413 317.8035 327.9101 355.4200 358.2117 371.4042 384.4479 418.0811 434.0406 466.6587 483.8604 529.0775 579.1553 583.4944 612.4205 625.9687 641.9906 662.4800 675.8002 695.1868 749.9022 760.7994 801.2633 837.7712 850.3814 851.8276 863.4177 887.7988 928.5727 930.4268 948.2317 952.4722 972.7728 978.1182 1010.1503 1024.6720 1036.4119 1052.7688 1075.7530 1097.5694 1120.9889 1135.0247 1141.0798 1155.8735 1163.3328 1169.5357 1214.4325 1235.8871 1241.7017 1252.4488 1263.7996 1273.9898 1276.2514 1296.2327 1305.2009 1335.1060 1346.4908 1357.2866 1375.5382 1391.1488 1399.1730 1419.2872 1426.1783 1435.0806 1446.6410 1451.7286 1467.9064 1469.1925 1479.8676 1515.6292 1600.2978 1628.1121 3003.0053 3007.6609 3020.1145 3025.5069 3035.8460 3050.9007 3114.5590 3121.6590 3131.6460 3143.4260 3148.2726 3158.9400 3172.2832 3306.8648 3566.1835 3587.1203
redmass: 6.0528 6.0174 6.7972 4.6050 3.6277 5.2623 1.2478 2.6787 4.0733 3.2424 4.0480 6.3932 5.7424 3.7081 2.1417 4.2467 1.8153 2.2761 5.4016 2.0081 3.8010 4.2847 3.4711 4.8894 5.8742 5.1576 4.8571 3.9991 4.9046 5.9990 1.6226 5.1971 5.8274 2.3644 1.3649 3.7372 6.7876 4.7953 3.0145 1.5944 5.4157 6.3829 3.8758 1.3990 4.4019 3.0940 1.3034 7.3020 2.0351 1.9601 4.9658 2.3304 3.7916 2.1927 1.2465 2.1453 1.7850 1.3890 1.2747 1.8873 1.3008 1.5996 1.5524 1.6775 2.6509 1.2668 1.2815 1.6413 1.2756 1.6771 1.4735 1.4469 1.2944 1.7413 3.2246 1.3405 1.6612 1.4004 1.0508 3.7241 1.7482 1.4096 1.0787 4.5261 7.2701 7.9191 1.0849 1.0285 1.0710 1.0812 1.0860 1.0856 1.1052 1.1027 1.0854 1.0906 1.1060 1.0956 1.0993 1.0677 1.0660 1.0666
irintensity: 0.4301 0.5890 2.8724 0.6784 6.0576 1.4026 0.1886 5.5561 1.6300 1.6882 3.4504 25.3893 1.7883 20.3742 31.3621 11.0739 101.9671 35.8970 9.7095 49.3094 28.7438 35.9133 20.2168 19.5233 9.7262 2.9814 10.3142 1.0731 6.2658 2.2331 62.3390 46.7671 15.6245 26.8861 96.8058 5.4885 52.1095 46.8262 8.7086 1.1334 31.6731 21.1530 92.7916 4.7382 183.9934 71.4442 0.2096 68.4149 13.2015 21.4986 33.3264 17.2610 93.5745 4.3045 0.0334 2.6101 19.9813 11.7714 1.2236 30.4274 70.8237 2.4632 12.1525 14.5199 74.8739 27.9918 7.0508 7.5555 14.9597 60.6131 8.0466 43.3815 1.1098 100.3293 19.0733 53.6385 78.2900 40.8499 15.0206 110.9577 7.1709 26.0625 9.2086 372.4548 4.8315 24.6169 21.6606 46.4527 30.6877 45.6833 4.7090 24.9051 18.7705 6.0149 0.2625 15.9039 16.3456 22.8159 19.4594 242.6692 18.1593 19.0408
temp: 298.150 k
press: 1.00000 atm
elementType: 8 8 8 8 8 7 7 6 6 6 6 6 6 6 6 6 6 6 6 6 1 1 1 1 1 1 1 1 1 1 1 1 1 1 1 1
symmnumber: 1
zpe: 740003.3 jmol-1
zpe.correction: 0.281852 hartree
zpe.thermalcorrener: 0.300524 hartree
zpe.thermalcorrenthalpy: 0.301469 hartree
zpe.thermalcorrgfe: 0.234601 hartree
zpe.sumelectzpe: -989.061747 hartree
zpe.sumelectthermal: -989.043075 hartree
zpe.sumelectthermalent: -989.042131 hartree
zpe.sumelectthermalfe: -989.108999 hartree
dipole: 2.7867 0.8662 -1.8968
dipole: 3.4805
quadrupole: -111.3498 -109.2284 -115.9379
quadrupole: 5.0958 -9.8747 4.1262
quadrupole: 0.8222 2.9436 -3.7659 5.0958 -9.8747 4.1262
hfenergy: -989.3435996 hartree
pointgroup: C01 [X(C13H16N2O5)]
dipole: 1.1247682 -0.5233324 0.5797788 debye
polarizability: 235.3126611|-9.382423|154.449388|-13.0373072|23.553923|120.9421678 unknown
InChI: InChI=1S/C13H16N2O5/c1-19-13-14-7-4-2-3-5-8(7)15(13)12-11(18)10(17)9(6-16)20-12/h2-5,9-12,16-18H,6H2,1H3
charge 0 multiplicity 1
36 atoms
O  1.215123 0.450971 1.469534
O  1.231865 2.483799 -1.525024
O  4.105935 1.367165 -0.699855
O  4.621555 -0.963693 0.608324
O  0.678982 -1.595242 -1.226035
N  -0.571903 0.141039 -0.137388
N  -1.717576 -1.683273 -0.962699
C  0.514721 1.011824 0.262846
C  1.614322 1.286784 -0.782877
C  2.884251 1.491107 0.079635
C  2.686675 0.478998 1.241437
C  3.167071 -0.95621 0.923752
C  -1.942607 0.346178 0.182618
C  -0.530827 -1.097325 -0.804451
C  -2.635038 -0.790561 -0.349184
C  -2.608966 1.386647 0.854088
C  -4.035041 -0.894043 -0.215998
C  -4.012229 1.267571 0.981507
C  -4.713854 0.14747 0.454609
C  0.588556 -2.886642 -1.953022
H  0.063895 1.976514 0.554728
H  1.762238 0.426106 -1.459804
H  2.8550 2.52235 0.48251
H  3.146768 0.837954 2.180641
H  2.668981 -1.345177 0.02349
H  2.942565 -1.627735 1.77277
H  1.960696 2.693534 -2.162866
H  4.549566 0.497323 -0.465592
H  -2.082558 2.252523 1.268292
H  5.152249 -0.89792 1.440304
H  -4.566863 -1.759097 -0.623146
H  -4.569777 2.055946 1.498694
H  -5.801426 0.093789 0.573757
H  0.142164 -3.654388 -1.30003
H  1.628063 -3.131638 -2.213995
H  -0.036574 -2.766549 -2.852973
