program: Gaussian 09
title: 000270853
version: EM64L-G09RevD.01
frameworkgroup: C1[X(C12H14BrN5O5)]
method: RPBEPBE
basis: SDD
operation: Freq
keyword: #p
keyword: freq=noraman
keyword: PBEPBE/SDD
title: #p freq=noraman PBEPBE/SDD
converged: YES YES NO NO
title: Mulliken charges:
elementType: Br O O O O O N N N N N C C C C C C C C C C C C H H H H H H H H H H H H H H
charge: 0.082286 -0.244788 -0.451278 -0.469454 -0.498716 -0.344829 -0.144599 -0.103873 -0.067961 -0.620971 -0.607064 -0.063174 -0.155742 -0.182204 -0.075409 -0.394420 0.119965 -0.347215 0.032690 0.323961 0.122212 0.197205 -0.378222 0.225425 0.309545 0.249955 0.251730 0.288297 0.225161 0.363591 0.381292 0.372597 0.239740 0.399756 0.320512 0.304444 0.339556
chargesum: 0.00000
title: Mulliken charges with hydrogens summed into heavy atoms:
elementType: Br O O O O O N N N N N C C C C C C C C C C C C
charge: 0.082286 -0.244788 -0.087687 -0.088162 -0.126120 -0.344829 -0.144599 -0.103873 -0.067961 0.099297 0.036936 0.162251 0.153804 0.067750 0.176321 0.119038 0.119965 -0.347215 0.032690 0.323961 0.122212 0.197205 -0.138482
polarizability: 2.60256245e+02 -2.12398215e+00 2.42880357e+02 3.12456611e+00 3.06193944e+00 1.10872896e+02
1716.lowfreq: -5.0695 -4.1388 -0.0005 0.0005 0.0007 1.7450 28.2992 34.0247 35.7567
frequency: 28.2817 34.0085 35.7425 45.9780 54.7284 74.9542 109.8364 113.4374 150.3284 158.3512 187.1041 208.1291 210.8355 222.1335 255.7901 271.5672 281.7343 288.9404 311.7460 324.9323 326.1797 345.8574 362.7733 369.1168 376.3441 409.3031 463.3910 483.9099 520.0709 533.1938 548.5622 556.6175 560.8063 576.0543 595.9175 599.2783 612.4636 642.3549 646.4205 676.1831 687.6228 695.4871 743.6112 773.0143 797.8346 810.6344 837.0915 883.4179 910.8917 929.1958 933.9175 941.7016 958.4937 973.3469 989.0764 1037.5550 1042.1141 1066.1876 1071.9408 1076.1735 1101.5762 1108.7503 1162.7827 1178.8178 1203.9561 1208.6325 1245.9182 1255.4710 1258.0980 1274.1243 1280.2280 1287.6641 1306.7558 1327.5344 1343.5889 1348.6881 1353.8703 1376.5786 1398.2052 1401.4098 1405.5206 1427.1211 1452.3436 1454.1216 1483.1845 1493.4565 1510.5885 1536.9801 1577.9160 1613.8636 1637.0828 2985.4959 2991.2774 3042.6569 3048.7428 3058.4883 3070.2220 3152.9265 3187.5000 3284.9266 3501.5189 3571.4674 3602.5408 3612.1388 3657.7118
redmass: 6.0046 5.8136 7.2263 7.9212 6.1140 7.5587 6.3005 8.7900 7.8531 3.4995 6.2215 6.4471 6.7729 9.0417 12.3962 3.8872 5.5080 2.4712 5.8222 5.2325 1.8188 2.0527 4.2773 2.1554 5.1681 4.2921 3.9799 4.5048 3.5210 1.3962 5.2814 4.1204 1.6089 5.1579 2.6614 1.5380 1.2474 2.4970 3.8204 6.4957 4.9905 5.0642 9.0062 8.1504 11.3830 6.9924 2.7386 5.0912 1.0908 6.8325 1.4004 7.4807 5.7845 2.7480 3.4305 5.0470 2.5045 2.6934 2.5868 3.2904 2.2367 2.0413 2.5118 1.4660 1.3891 1.3711 1.2048 1.8683 1.7696 2.9380 1.2982 1.3694 4.7967 2.6489 2.0942 2.0713 1.4434 1.4214 1.9608 5.4665 1.4547 1.6125 1.3789 2.9226 6.7181 1.0816 2.5382 7.8874 2.4464 1.8473 1.9227 1.0577 1.0841 1.0865 1.0958 1.0855 1.1016 1.0917 1.0690 1.0678 1.0460 1.0660 1.0669 1.0868 1.1041
irintensity: 3.0887 2.9341 1.3313 2.0947 5.9377 1.9624 0.8104 1.7309 1.8824 11.2198 2.8075 4.2230 20.4077 0.9592 0.9631 8.6220 28.5686 36.6535 1.8435 8.7160 47.6603 46.8984 3.6287 88.1243 12.5248 41.2378 20.5570 13.9580 17.8282 40.0141 27.4406 6.7529 62.9572 39.4271 50.6855 203.0289 112.5396 13.4904 11.9894 17.0332 5.8847 24.0032 29.8629 6.8572 1.5943 66.1568 15.1728 26.7244 154.0297 37.3944 0.5426 85.5647 219.3326 33.6221 2.2373 24.7580 44.3705 11.2105 40.6726 31.9929 6.2088 60.9519 44.5974 6.6483 3.5090 46.0596 15.8171 35.5154 1.8924 67.5407 23.7174 35.3562 13.6971 104.1237 46.5568 23.2177 18.4413 7.4596 60.6903 93.4575 6.5694 5.3197 115.7515 84.2643 231.4300 8.6775 65.4404 48.3790 423.8341 460.6894 231.2693 22.1775 30.5515 1.1504 29.7760 14.1406 27.1133 30.6828 427.4947 286.6182 35.8058 21.0161 14.4195 105.8811 103.4331
temp: 298.150 k
press: 1.00000 atm
elementType: 35 8 8 8 8 8 7 7 7 7 7 6 6 6 6 6 6 6 6 6 6 6 6 1 1 1 1 1 1 1 1 1 1 1 1 1 1
symmnumber: 1
zpe: 714859.1 jmol-1
zpe.correction: 0.272275 hartree
zpe.thermalcorrener: 0.293742 hartree
zpe.thermalcorrenthalpy: 0.294686 hartree
zpe.thermalcorrgfe: 0.220427 hartree
zpe.sumelectzpe: -1127.312297 hartree
zpe.sumelectthermal: -1127.290830 hartree
zpe.sumelectthermalent: -1127.289886 hartree
zpe.sumelectthermalfe: -1127.364145 hartree
dipole: -0.6412 -1.1064 -1.6740
dipole: 2.1065
quadrupole: -134.0605 -133.6478 -145.4859
quadrupole: 20.2002 -6.0176 -1.6335
quadrupole: 3.6709 4.0836 -7.7545 20.2002 -6.0176 -1.6335
hfenergy: -1127.584572 hartree
pointgroup: C01 [X(C12H14Br1N5O5)]
dipole: -0.1826757 0.4347788 0.6815002 debye
polarizability: 260.1813786|0.5972743|242.1901117|-7.5143616|8.2822093|111.638008 unknown
InChI: InChI=1S/C12H14BrN5O5/c13-8-4(10(15)22)5-9(14)16-2-17-11(5)18(8)12-7(21)6(20)3(1-19)23-12/h2-3,6-7,12,19-21H,1,14-15H2
charge 0 multiplicity 1
37 atoms
Br -1.263368 3.319438 0.236124
O  1.931684 1.034329 1.107707
O  2.037334 1.732122 -2.440181
O  4.611965 0.187054 -1.331851
O  4.799109 -1.346599 0.850469
O  -4.715581 -0.14743 0.120084
N  -0.080681 0.715986 -0.18914
N  0.534215 -1.645754 -0.4942
N  -1.35459 -3.19526 -0.515222
N  -3.580143 -2.527592 -0.247206
N  -4.270588 2.083344 0.347118
C  1.258858 1.309861 -0.1899
C  2.216559 0.836447 -1.300269
C  3.607007 0.964595 -0.628995
C  3.325682 0.564658 0.845796
C  3.388389 -0.948728 1.120875
C  -0.388421 -0.654145 -0.309404
C  -1.292373 1.397892 0.006793
C  -1.799401 -0.813484 -0.204582
C  -2.386758 0.513133 -0.001297
C  -2.271074 -2.177067 -0.319739
C  -3.840083 0.790401 0.156126
C  -0.036579 -2.88178 -0.590073
H  1.1280 2.400719 -0.289765
H  2.037214 -0.217728 -1.575228
H  3.906936 2.031158 -0.668732
H  3.982138 1.100176 1.552051
H  2.680549 -1.489157 0.464503
H  3.133136 -1.13579 2.180479
H  2.670459 1.454585 -3.149676
H  4.938376 -0.537591 -0.716001
H  4.923315 -2.308425 1.037969
H  0.648451 -3.721521 -0.744811
H  -4.279373 -1.770923 -0.102683
H  -3.811479 -3.515483 -0.342444
H  -3.642026 2.884293 0.386867
H  -5.275862 2.220569 0.448637
