program: Gaussian 09
title: 000270846
version: EM64L-G09RevD.01
frameworkgroup: C1[X(C4H7Cl2O3P)]
method: RPBEPBE
basis: SDD
operation: Freq
keyword: #p
keyword: freq=noraman
keyword: PBEPBE/SDD
title: #p freq=noraman PBEPBE/SDD
converged: YES YES NO NO
title: Mulliken charges:
elementType: Cl Cl P O O O C C C C H H H H H H H
charge: 0.082958 0.082958 1.364613 -0.477056 -0.477059 -0.551641 -0.402967 -0.286133 -0.286129 -0.770363 0.220553 0.257726 0.253860 0.200812 0.200812 0.253859 0.333197
chargesum: 0.00000
title: Mulliken charges with hydrogens summed into heavy atoms:
elementType: Cl Cl P O O O C C C C
charge: 0.082958 0.082958 1.364613 -0.477056 -0.477059 -0.551641 0.075312 0.168539 0.168543 -0.437166
polarizability: 1.06429327e+02 -5.55207794e-04 9.53639436e+01 7.01127551e+00 2.27232458e-05 7.71072063e+01
1716.lowfreq: -14.2981 -12.4866 -9.7272 -0.0016 -0.0013 0.0018 17.8532 35.6688 80.1752
frequency: 15.0911 35.6613 80.0747 134.1337 148.1883 179.9880 217.3061 279.8955 289.2883 311.9160 328.2144 394.5402 399.8327 527.6578 580.6905 600.4898 636.0365 675.0635 722.4702 817.0173 861.1409 896.7808 919.0303 1017.8787 1061.6179 1080.0448 1106.4938 1155.9195 1175.0930 1178.4571 1219.1451 1247.8225 1342.1484 1356.1671 1357.3356 1432.7394 1464.6088 1475.9498 2970.8690 2973.8216 3002.1186 3070.8349 3092.2706 3096.1466 3109.8649
redmass: 11.3327 4.5939 3.0240 6.1909 12.5411 12.1348 12.5172 8.7744 12.3540 1.9274 8.7943 6.4177 8.7710 2.0214 7.2755 8.5618 10.7234 10.8744 7.2823 3.1256 3.2296 1.5244 2.8980 3.6015 2.1785 8.6125 1.8194 1.0596 1.1168 1.2238 1.3032 1.1708 1.2008 1.4452 1.2547 1.0871 1.0818 1.0896 1.0682 1.0680 1.0621 1.0990 1.0970 1.1001 1.0875
irintensity: 0.8652 5.1695 0.0556 1.3375 2.6413 1.9796 0.5250 3.2378 1.9265 6.0602 32.5831 6.9768 49.5224 2.4487 48.0966 77.6066 64.0508 127.3393 0.2280 69.8167 26.9360 1.1402 68.5916 207.3742 0.7806 110.1751 5.6586 7.2353 1.0265 14.0187 6.4698 5.0221 7.2629 2.6154 14.6236 19.0776 3.6504 10.0944 16.4044 78.7225 18.7592 19.6891 15.0378 18.8099 4.8216
temp: 298.150 k
press: 1.00000 atm
elementType: 17 17 15 8 8 8 6 6 6 6 1 1 1 1 1 1 1
symmnumber: 1
zpe: 299292.8 jmol-1
zpe.correction: 0.113995 hartree
zpe.thermalcorrener: 0.125506 hartree
zpe.thermalcorrenthalpy: 0.126450 hartree
zpe.thermalcorrgfe: 0.073823 hartree
zpe.sumelectzpe: -1642.796309 hartree
zpe.sumelectthermal: -1642.784797 hartree
zpe.sumelectthermalent: -1642.783853 hartree
zpe.sumelectthermalfe: -1642.836480 hartree
dipole: -4.7598 0.0001 -6.1842
dipole: 7.8038
quadrupole: -69.7889 -83.1234 -86.4982
quadrupole: -0.0002 3.9796 0.0003
quadrupole: 10.0146 -3.3199 -6.6947 -0.0002 3.9796 0.0003
hfenergy: -1642.9103032 hartree
pointgroup: C01 [X(C4H7Cl2O3P1)]
dipole: 2.0828442 -0.0001592 -2.2556967 debye
dipolederiv: -0.3110096 0.2741066 -0.0581709 0.2196727 -0.5298711 0.0410046 -0.0964083 0.0420838 -0.0861877 -0.3109436 -0.2740834 -0.0581093 -0.2196601 -0.5299513 -0.0409222 -0.0963586 -0.0420049 -0.0861732 2.2210024 0.0000123 -0.2803456 0.0000504 1.291466 0.000012 0.1143841 0.0000356 1.5229001 -1.2323967 -0.2259714 0.255217 -0.2801123 -0.6013005 0.135066 0.2886221 0.1730715 -0.6624136 -1.2324552 0.2259829 0.2551788 0.2801392 -0.6013311 -0.1350574 0.2885706 -0.1730624 -0.6623428 -0.6588182 -0.0000071 0.0232695 -0.0000134 -0.4688411 -0.0000153 -0.0373114 -0.0000206 -0.6217566 -0.1241548 0.0000033 0.0282448 0.0000084 -0.0990792 0.0000175 0.0802588 0.000021 0.033235 0.6917174 0.0976477 -0.1611767 -0.1462506 0.1763993 0.0177667 -0.3478842 -0.1735656 0.473927 0.6917285 -0.0976514 -0.1611596 0.1462072 0.1764441 -0.0177092 -0.3479366 0.1736042 0.4738915 0.4268359 -0.0000306 0.1365879 -0.0000457 1.0510531 -0.0001072 0.0265534 -0.0001133 -0.0579083 -0.0691633 0.0000065 0.1125659 0.0000102 0.0934474 -0.0000042 0.1398493 -0.0000028 0.0198376 0.0981058 -0.0000029 -0.046568 -0.0000106 0.0374202 -0.0000149 -0.1052998 -0.0000174 -0.0657774 -0.032201 -0.1052328 0.0310778 -0.0731335 -0.0501132 -0.0059866 0.0353565 -0.0105638 0.0716556 -0.0332568 0.0205963 -0.0672941 0.0378652 0.0736045 -0.0418465 0.0127611 0.0522942 -0.1827502 -0.0332506 -0.0206198 -0.0672878 -0.0378706 0.0735956 0.0417772 0.0127798 -0.0523563 -0.1827495 -0.032219 0.1052422 0.0310504 0.073145 -0.0500942 0.0060201 0.035337 0.0105985 0.0716511 -0.059521 0.0000016 0.0269199 -0.0000015 -0.0428483 -0.0000007 -0.0032737 -0.0000017 -0.0590386 unknown
polarizability: 107.4443231|-0.0003768|95.3639434|-4.2855471|-0.0019335|76.0922099 unknown
InChI: InChI=1S/C4H7Cl2O3P/c5-4(6)10(7)8-2-1-3-9-10/h4H,1-3H2
charge 0 multiplicity 1
17 atoms
Cl -2.614163 1.534303 -0.712089
Cl -2.613953 -1.534718 -0.711778
P  -0.340294 0.000085 0.715005
O  0.66243 1.388178 0.371561
O  0.662534 -1.388006 0.371869
O  -0.964075 0.000226 2.160938
C  2.632056 0.000085 -0.341122
C  1.80522 1.272367 -0.582609
C  1.805333 -1.272329 -0.582305
C  -1.577755 -0.00014 -0.74801
H  3.500976 0.00004 -1.027956
H  3.0205 0.000228 0.693339
H  2.389206 2.186743 -0.393984
H  1.41638 1.3050 -1.621805
H  1.416513 -1.305251 -1.6215
H  2.389397 -2.186608 -0.393445
H  -1.035202 -0.000201 -1.702708
