program: Gaussian 09
title: 000270844
version: EM64L-G09RevD.01
frameworkgroup: C1[X(C7H13Cl4O3P)]
method: RPBEPBE
basis: SDD
operation: Freq
keyword: #p
keyword: freq=noraman
keyword: PBEPBE/SDD
title: #p freq=noraman PBEPBE/SDD
converged: YES YES NO NO
title: Mulliken charges:
elementType: Cl Cl Cl Cl P O O O C C C C C C C H H H H H H H H H H H H H
charge: 0.059670 0.069929 -0.095711 -0.083833 1.356629 -0.509573 -0.531548 -0.579636 -0.244482 -0.259909 -0.352510 -0.349197 -0.756680 -0.563347 -0.588301 0.232206 0.245609 0.233778 0.243082 0.236861 0.229796 0.236424 0.239099 0.373822 0.277078 0.297668 0.266217 0.316858
chargesum: 0.00000
title: Mulliken charges with hydrogens summed into heavy atoms:
elementType: Cl Cl Cl Cl P O O O C C C C C C C
charge: 0.059670 0.069929 -0.095711 -0.083833 1.356629 -0.509573 -0.531548 -0.579636 0.233333 0.216952 0.114146 0.126327 -0.382858 0.011399 -0.005226
polarizability: 1.68639241e+02 1.91772357e+00 1.39537907e+02 8.79604195e+00 7.71166616e+00 1.27161991e+02
1716.lowfreq: -8.1685 -1.6590 -0.0012 -0.0004 0.0009 1.3910 6.1427 17.1320 36.2376
frequency: 5.4753 16.1811 35.9904 39.5361 46.5019 57.0369 67.6386 89.6514 132.0282 143.0769 148.5324 166.1385 176.6601 203.1085 206.3429 223.9592 252.0222 285.9765 297.5393 322.6989 367.4324 395.4651 425.5462 441.5956 477.4239 582.7922 592.9287 598.9446 615.8045 669.7710 680.5048 734.4104 780.2925 811.8715 875.0233 881.5476 914.2316 917.4274 967.7506 1007.8046 1028.5967 1043.0337 1053.1701 1096.4608 1105.4831 1151.2674 1167.4883 1169.3025 1191.4708 1192.3358 1196.7314 1259.8772 1267.9839 1299.9966 1310.4205 1354.6544 1359.1925 1363.8475 1365.7079 1429.9287 1433.6483 1452.4692 1454.1431 1463.0324 1483.1094 2990.2200 2993.2131 3013.3402 3016.6588 3049.2338 3052.2972 3061.2047 3072.3680 3085.6845 3100.3294 3108.8933 3145.2391 3158.3880
redmass: 8.3124 11.7859 7.5111 13.2784 10.9306 5.6992 6.6275 10.1262 4.8473 6.9183 4.6020 9.2566 4.8177 3.0571 5.3870 6.6880 3.8078 4.5581 5.1289 5.7421 3.2838 2.4437 7.5328 2.5612 3.8886 4.9099 5.1136 6.1355 6.3818 8.5831 7.2968 6.4345 1.5107 2.2032 2.0698 2.9405 3.1787 2.7139 2.2630 1.9087 1.5786 1.6600 10.6247 2.6503 1.9565 1.3235 1.1241 1.0703 1.1336 1.1452 1.1474 1.1528 1.1631 1.1667 1.1579 1.2276 1.5322 1.3215 1.4114 1.0769 1.0866 1.0975 1.0848 1.0908 1.0751 1.0605 1.0616 1.0583 1.0613 1.0831 1.0973 1.0726 1.0595 1.1082 1.1062 1.0883 1.1120 1.1117
irintensity: 0.6274 0.3516 2.5010 0.9099 0.7869 0.8518 2.3195 3.6358 5.6667 0.2287 0.3345 7.4333 7.8454 11.8985 6.4535 6.4197 6.1685 2.5937 1.8441 18.3409 2.6708 14.6925 47.6259 4.8236 19.3164 25.8252 17.2750 40.8422 55.6982 6.1157 163.4091 0.9759 25.6322 28.2917 55.4515 15.9125 255.3793 111.5312 141.6768 49.7220 12.6184 15.6873 102.9553 9.0316 8.1454 4.5477 1.4698 4.5041 0.3652 3.1224 14.3538 3.7854 7.8409 14.7717 19.4028 5.9523 3.3781 9.3391 2.9727 24.3517 13.9549 13.4014 19.4717 5.9598 15.8141 12.0766 10.9588 20.5456 25.8518 22.3079 17.0759 19.6411 22.7511 14.2059 11.6729 18.7364 3.4147 4.2566
temp: 298.150 k
press: 1.00000 atm
elementType: 17 17 17 17 15 8 8 8 6 6 6 6 6 6 6 1 1 1 1 1 1 1 1 1 1 1 1 1
symmnumber: 1
zpe: 527523.8 jmol-1
zpe.correction: 0.200923 hartree
zpe.thermalcorrener: 0.220365 hartree
zpe.thermalcorrenthalpy: 0.221309 hartree
zpe.thermalcorrgfe: 0.146957 hartree
zpe.sumelectzpe: -2680.436930 hartree
zpe.sumelectthermal: -2680.417489 hartree
zpe.sumelectthermalent: -2680.416545 hartree
zpe.sumelectthermalfe: -2680.490897 hartree
dipole: -3.1392 -2.9604 2.9327
dipole: 5.2172
quadrupole: -128.8006 -117.8706 -132.0671
quadrupole: 10.9032 17.5960 0.7222
quadrupole: -2.5545 8.3755 -5.8210 10.9032 17.5960 0.7222
hfenergy: -2680.6378535 hartree
pointgroup: C01 [X(C7H13Cl4O3P1)]
dipole: -1.1717866 1.4965686 -0.7748831 debye
polarizability: 170.4074242|1.1674544|132.1142881|-3.9301926|9.8556012|132.8174261 unknown
InChI: InChI=1S/C7H13Cl4O3P/c8-3-1-5-13-15(12,7(10)11)14-6-2-4-9/h7H,1-6H2
charge 0 multiplicity 1
28 atoms
Cl 0.72942 -2.056504 -2.03168
Cl -1.720608 -2.517194 -0.254361
Cl -3.542475 0.864586 -1.920378
Cl 4.883223 0.790181 1.308878
P  0.163746 -0.151731 0.325827
O  -1.236428 0.586618 1.034842
O  0.838792 1.056169 -0.715197
O  1.128235 -0.839465 1.378946
C  -1.754534 1.909723 0.579175
C  2.150758 1.721656 -0.422083
C  -3.278544 1.871498 0.721356
C  3.329528 0.94246 -1.028222
C  -0.607198 -1.25367 -1.026863
C  -3.953345 0.746416 -0.059958
C  3.956189 -0.097557 -0.095258
H  -1.319775 2.684623 1.23508
H  -1.454053 2.101648 -0.466293
H  2.031988 2.70498 -0.904753
H  2.278165 1.855862 0.668337
H  -3.54104 1.728381 1.788891
H  -3.678468 2.856167 0.412111
H  4.110095 1.660124 -1.343996
H  2.971464 0.437044 -1.947598
H  -1.220484 -0.639855 -1.700938
H  -5.05025 0.80221 -0.017034
H  -3.59236 -0.246715 0.241022
H  4.723618 -0.70065 -0.601147
H  3.216845 -0.732404 0.415395
