program: Gaussian 09
title: 000270841
version: EM64L-G09RevD.01
frameworkgroup: C1[X(C6H13Cl2O4P)]
method: RPBEPBE
basis: SDD
operation: Freq
keyword: #p
keyword: freq=noraman
keyword: PBEPBE/SDD
title: #p freq=noraman PBEPBE/SDD
converged: YES YES NO NO
title: Mulliken charges:
elementType: Cl Cl P O O O O C C C C C C H H H H H H H H H H H H H
charge: 0.061660 0.071324 1.348936 -0.520134 -0.544448 -0.594656 -0.441109 0.028470 -0.752685 -0.666250 -0.663257 -0.240630 -0.300391 0.236382 0.369033 0.217877 0.244913 0.220542 0.206964 0.239713 0.228215 0.241800 0.226642 0.208667 0.216475 0.355946
chargesum: 0.00000
title: Mulliken charges with hydrogens summed into heavy atoms:
elementType: Cl Cl P O O O O C C C C C C
charge: 0.061660 0.071324 1.348936 -0.520134 -0.544448 -0.594656 -0.085164 0.264852 -0.383651 0.017083 0.011634 0.227812 0.124751
polarizability: 1.37919308e+02 3.26647661e+00 1.18438174e+02 -1.74618678e+00 -6.15572689e+00 1.09808875e+02
1716.lowfreq: -13.7066 -10.5381 -9.6496 -0.0012 0.0015 0.0021 17.6118 21.4015 28.0975
frequency: 14.5779 20.4325 27.8035 30.7543 34.3451 72.5579 111.6053 116.8548 132.4890 163.8407 188.5243 207.2285 231.9228 238.9207 244.7422 279.6130 297.3500 331.0424 347.9601 406.3865 429.5898 442.5979 461.1374 498.9688 588.0164 644.6841 677.9178 691.0704 751.3793 835.6244 865.1421 879.1288 902.5940 926.4211 937.2952 972.2416 1033.8777 1044.4752 1085.8148 1091.1513 1154.1022 1159.9862 1180.6770 1184.1122 1187.4869 1209.2041 1325.1442 1332.0066 1333.6309 1350.5672 1378.5933 1380.6554 1394.5641 1453.9517 1454.7184 1456.5982 1463.1857 1469.9594 1485.0353 2974.8159 2985.4215 2994.4964 3001.3721 3013.3752 3075.1857 3080.7691 3083.2513 3092.9378 3096.2797 3107.5665 3133.9005 3540.8019
redmass: 3.9063 6.9316 7.6487 4.0463 4.2223 3.9828 7.4876 4.9327 5.3912 7.8952 1.0271 9.7362 1.7099 2.5281 2.9694 3.5098 9.1775 3.4761 4.1548 4.0026 2.3520 4.7145 1.2609 3.8369 5.8846 5.4653 10.2273 4.7588 6.7435 5.8861 2.3896 3.1859 2.9450 1.2508 1.3123 2.6726 11.3587 3.5060 1.7922 1.6314 2.0201 1.0841 1.9432 1.1357 1.1810 1.1864 1.2866 1.2191 1.3454 1.2428 1.2642 1.2586 1.2235 1.0534 1.0855 1.0857 1.0482 1.0494 1.0481 1.0671 1.0353 1.0357 1.0557 1.0871 1.0996 1.1062 1.0989 1.1002 1.1003 1.1008 1.0873 1.0657
irintensity: 0.7417 0.2627 1.9826 1.2240 1.3642 1.5005 0.8708 3.8425 8.4594 9.0441 0.0389 2.4036 2.6880 5.0002 3.9830 10.9545 0.9960 7.8590 11.8143 7.1255 13.0882 42.3546 217.5412 15.8640 16.4157 45.5300 78.5950 41.8881 9.1975 223.2845 12.3475 199.8990 79.8102 2.2832 0.2449 148.8118 105.8696 56.3905 1.6910 74.3744 11.7574 5.3464 16.5684 5.5186 9.7991 14.0077 11.8471 11.2344 7.8386 5.1994 39.9825 12.0379 25.2167 5.6682 18.6695 4.3152 4.8126 5.9616 16.1453 53.6162 12.5332 16.1745 28.2950 7.6581 28.2406 30.5002 11.8023 23.0009 29.9810 25.7679 0.0778 12.4579
temp: 298.150 k
press: 1.00000 atm
elementType: 17 17 15 8 8 8 8 6 6 6 6 6 6 1 1 1 1 1 1 1 1 1 1 1 1 1
symmnumber: 1
zpe: 507171.4 jmol-1
zpe.correction: 0.193171 hartree
zpe.thermalcorrener: 0.210861 hartree
zpe.thermalcorrenthalpy: 0.211806 hartree
zpe.thermalcorrgfe: 0.142893 hartree
zpe.sumelectzpe: -1797.570694 hartree
zpe.sumelectthermal: -1797.553004 hartree
zpe.sumelectthermalent: -1797.552060 hartree
zpe.sumelectthermalfe: -1797.620973 hartree
dipole: 0.2203 1.6312 -0.4019
dipole: 1.6943
quadrupole: -101.1102 -90.2232 -109.4666
quadrupole: 0.6743 12.1510 4.6585
quadrupole: -0.8435 10.0435 -9.1999 0.6743 12.1510 4.6585
hfenergy: -1797.7638657 hartree
pointgroup: C01 [X(C6H13Cl2O4P1)]
dipole: -0.4199133 -0.2285717 -0.4645363 debye
dipolederiv: -0.4552187 0.2815024 0.0386215 0.2157448 -0.2941535 -0.0823203 0.1111468 -0.1356608 -0.181947 -0.2639511 0.1281894 -0.1882689 0.1957633 -0.2352884 0.1275342 -0.275022 0.1278432 -0.4644114 2.0123952 -0.0210988 -0.1781985 0.3221644 1.8224165 0.4471122 -0.2559359 0.1003733 1.390494 -1.342042 -0.5277817 -0.1222449 -0.5596714 -0.8342955 -0.1335002 -0.0318917 -0.0571812 -0.5329593 -1.1404975 0.3881378 0.360626 0.5270568 -0.9919465 -0.4163182 0.3688266 -0.3140959 -0.7433145 -0.6624033 -0.0063532 -0.0176564 -0.0932567 -0.7206007 -0.0573437 -0.0174413 0.0253122 -0.6776089 -0.6189851 -0.064876 -0.0584487 -0.0632541 -0.2986245 0.147651 -0.1288967 0.2197838 -0.6421983 1.0060917 0.4936905 0.0712805 0.2117682 0.3742037 0.0902081 0.2665298 0.2152869 0.3991166 0.5794774 -0.4965504 0.0841118 -0.4472407 0.3656833 -0.1237353 0.2091559 -0.0639876 0.4445169 -0.0493438 -0.0827901 0.0297844 -0.0489528 -0.0187911 -0.0925478 -0.0362603 -0.1125506 -0.1780223 -0.0988759 -0.1151198 0.0669704 -0.0688777 0.0120188 0.026818 0.0387811 0.0117238 -0.0822542 0.2576581 -0.0522729 -0.1502963 -0.3587486 0.5673042 0.2838555 -0.4788403 0.3025986 0.4612341 0.3558439 0.0614298 0.0000152 0.1136493 0.2798926 -0.1317985 0.0486743 -0.1956742 0.4947268 -0.0229412 -0.0091501 0.0055155 0.0669819 -0.0966373 0.0105374 -0.0366431 -0.0094452 0.0205545 -0.0061684 0.0156403 -0.0093836 0.0048216 -0.0134887 -0.0098376 -0.0202923 -0.0189393 -0.026197 -0.1324646 -0.062237 -0.0871702 -0.0472936 0.077341 -0.0336766 -0.0672462 -0.0436873 0.0788147 0.0567569 -0.0342837 0.1083944 -0.0472882 0.0352835 0.0863899 0.0974167 0.0594882 -0.0081582 0.062635 0.1192022 -0.0023912 0.0942895 -0.0616258 -0.0011056 -0.0280648 0.0581742 0.0635033 -0.1417764 -0.0665679 -0.0462703 -0.0597939 0.0798767 0.009246 -0.06297 0.0096114 0.0684688 0.1235747 0.0060916 -0.0065345 0.0138245 0.0275504 -0.1050091 0.0189251 -0.080202 -0.0775095 0.0646938 0.1198662 -0.0194557 0.0646447 -0.067077 0.0464437 0.0133856 0.0122025 0.0833051 -0.0325188 -0.0916808 -0.0172988 -0.0373732 -0.0508078 -0.0509073 0.0737098 -0.0283574 0.0354768 0.054467 0.0394207 -0.0107387 0.051875 -0.0107578 0.0784941 0.0678615 0.0056478 -0.1361218 -0.0498363 -0.1070011 0.0159707 -0.1674786 -0.0810438 0.0794731 -0.023419 0.0476179 0.0061749 0.0471691 0.053315 0.0483805 0.0909778 -0.0289225 -0.1172474 0.0286068 -0.0523068 -0.0297872 0.3962601 0.0312778 0.0846858 0.0256674 0.1624901 -0.0784159 0.1199036 -0.0835753 0.2341031 unknown
polarizability: 133.63373|-10.8628264|113.5782359|-0.2141488|5.758441|118.9543908 unknown
InChI: InChI=1S/C6H13Cl2O4P/c1-5(2)12-13(10,6(7)8)11-4-3-9/h5-6,9H,3-4H2,1-2H3
charge 0 multiplicity 1
26 atoms
Cl -1.486615 2.726446 2.012446
Cl 0.843562 0.94526 2.893882
P  -0.222378 0.857274 -0.039305
O  -1.15611 -0.477565 0.517324
O  1.365459 0.20342 -0.180788
O  -0.816608 1.653917 -1.283806
O  2.929587 -2.068836 0.539123
C  -2.562922 -0.679548 -0.014899
C  0.108488 1.920404 1.505422
C  -2.491951 -1.469312 -1.327032
C  -3.293877 -1.40224 1.117676
C  1.66665 -0.846773 -1.19936
C  3.016316 -1.416777 -0.765094
H  -3.000362 0.321304 -0.196103
H  0.812405 2.722803 1.250728
H  -3.513326 -1.685125 -1.691245
H  -1.967785 -0.889998 -2.107139
H  -1.971114 -2.430675 -1.169485
H  -4.345429 -1.583509 0.829063
H  -3.279473 -0.797583 2.039706
H  -2.814595 -2.374146 1.327539
H  0.878904 -1.621908 -1.16339
H  1.712345 -0.382233 -2.201598
H  3.772716 -0.604398 -0.764158
H  3.334597 -2.199533 -1.474891
H  2.533212 -1.417166 1.174483
