program: Gaussian 09
title: 000270826
version: EM64L-G09RevD.01
frameworkgroup: C1[X(C13H11FN2O3S)]
method: RPBEPBE
basis: SDD
operation: Freq
keyword: #p
keyword: freq=noraman
keyword: PBEPBE/SDD
title: #p freq=noraman PBEPBE/SDD
converged: YES YES NO NO
title: Mulliken charges:
elementType: S F O O O N N C C C C C C C C C C C C C H H H H H H H H H H H
charge: 1.088627 -0.349539 -0.257484 -0.481671 -0.484834 -0.478606 -0.697675 0.517758 -0.139522 0.315077 -0.313673 -0.428446 -0.210359 -0.185824 0.136113 -0.535940 -0.405631 0.509926 -0.208148 -0.410919 0.326398 0.239561 0.322445 0.285057 0.285352 0.267395 0.210596 0.227564 0.226280 0.318036 0.312087
chargesum: 0.00000
title: Mulliken charges with hydrogens summed into heavy atoms:
elementType: S F O O O N N C C C C C C C C C C C C C
charge: 1.088627 -0.349539 -0.257484 -0.481671 -0.484834 -0.156161 -0.067552 0.517758 -0.139522 0.315077 0.012724 -0.188884 0.074699 0.099528 0.136113 -0.268545 -0.195036 0.509926 0.019416 -0.184638
polarizability: 3.78994517e+02 5.18942464e+00 1.89944085e+02 -8.62420116e+00 1.53416135e+00 9.20065704e+01
1716.lowfreq: -0.0017 0.0012 0.0013 0.6233 4.5312 8.6384 22.8567 24.8322 38.0682
frequency: 22.4544 24.5622 38.0669 58.5834 69.3139 101.7020 123.5716 143.0077 166.2527 194.5437 210.0080 219.4303 241.2538 280.6874 293.5742 328.1822 362.0444 378.0484 391.1250 393.7723 412.2793 413.8105 428.9717 436.4491 475.3027 511.5869 533.1731 553.0159 563.0157 610.7995 624.8416 663.4410 676.3627 686.4315 715.8154 731.6024 781.2551 793.9127 828.0237 844.9873 852.3772 862.1568 868.9270 910.1343 928.3589 958.7534 965.5988 980.4629 981.6738 992.1050 1002.4211 1030.6854 1050.2627 1090.7443 1114.8519 1124.0635 1185.9870 1188.2057 1216.4093 1269.4178 1295.5099 1307.9162 1334.5137 1369.3692 1404.2559 1416.0919 1457.4667 1476.8168 1490.2580 1502.2293 1579.0385 1588.5380 1598.9438 1610.6719 1630.6110 1647.9626 3121.8815 3130.2669 3132.5956 3142.7795 3158.0513 3162.8728 3170.3405 3198.8920 3525.9919 3565.5210 3705.1345
redmass: 6.6695 8.2733 5.6368 5.9762 7.5369 7.7733 7.6429 7.5368 8.6152 6.6368 4.7488 4.7595 8.7698 7.8226 9.4507 10.3888 7.1674 6.3284 3.4031 1.1217 2.9032 1.2085 3.4030 8.8572 4.6705 3.4650 5.9984 7.9017 5.4429 7.2468 7.3051 1.2560 6.5680 1.9782 3.2541 2.7920 2.9973 3.0297 1.4006 5.3027 13.2759 1.4435 1.5734 1.6334 3.6887 1.3543 1.3619 5.4629 5.4692 14.0298 1.3407 1.6200 2.4342 2.2507 1.4648 1.3154 1.1294 1.0848 2.5545 2.0043 1.3836 1.5212 2.2199 4.0616 7.2823 5.2784 3.2576 2.6102 2.8639 2.4166 6.4767 6.5339 5.5339 4.4467 3.6654 1.3511 1.0859 1.0914 1.0902 1.0916 1.0990 1.0916 1.0958 1.0953 1.0760 1.0452 1.1040
irintensity: 0.1994 0.1147 3.2266 0.3507 4.7707 1.9107 4.6603 1.6674 0.7116 8.0453 2.4222 4.1928 6.5602 16.0533 3.8491 17.1744 5.9626 6.3093 2.7496 40.9224 9.1280 266.9024 5.6043 57.5221 7.1198 31.1860 6.4417 147.1684 44.6231 30.2962 52.8371 41.2913 1.1359 15.5888 10.9075 61.1775 28.3812 17.2510 38.3520 4.6130 143.1115 68.6454 10.4369 26.4850 5.7227 1.4460 1.7921 20.6079 9.1755 78.6072 3.9226 13.4516 83.1570 8.2670 6.3829 9.7912 39.8709 3.4647 174.7253 46.9047 29.8920 109.2776 99.2864 355.9188 15.9096 18.4854 30.5329 8.7330 125.7919 679.0015 118.3197 38.1526 110.0013 145.3920 61.4096 273.3070 2.2036 32.0964 7.8460 6.7571 22.0203 3.9835 5.8293 14.6453 29.4939 94.7841 24.5412
temp: 298.150 k
press: 1.00000 atm
elementType: 16 9 8 8 8 7 7 6 6 6 6 6 6 6 6 6 6 6 6 6 1 1 1 1 1 1 1 1 1 1 1
symmnumber: 1
zpe: 577936.2 jmol-1
zpe.correction: 0.220124 hartree
zpe.thermalcorrener: 0.238801 hartree
zpe.thermalcorrenthalpy: 0.239745 hartree
zpe.thermalcorrgfe: 0.171204 hartree
zpe.sumelectzpe: -1333.495335 hartree
zpe.sumelectthermal: -1333.476659 hartree
zpe.sumelectthermalent: -1333.475715 hartree
zpe.sumelectthermalfe: -1333.544255 hartree
dipole: -12.1651 2.6055 0.4518
dipole: 12.4492
quadrupole: -127.8281 -113.7224 -132.3566
quadrupole: 5.0709 -7.2958 -1.3681
quadrupole: -3.1924 10.9133 -7.7209 5.0709 -7.2958 -1.3681
hfenergy: -1333.7154593 hartree
pointgroup: C01 [X(C13H11F1N2O3S1)]
dipole: 4.7866005 -1.0171075 0.2081504 debye
polarizability: 378.8885566|5.5252198|189.9336775|9.993118|-2.1647901|92.1229384 unknown
InChI: InChI=1S/C13H11FN2O3S/c14-20(18,19)12-6-4-11(5-7-12)16-13(17)9-2-1-3-10(15)8-9/h1-8,16H,15H2
charge 0 multiplicity 1
31 atoms
S  -5.430444 0.07153 -0.108871
F  -5.722819 0.438979 1.695113
O  1.362486 1.729546 -0.3457
O  -5.892728 1.390827 -0.902092
O  -6.100412 -1.368398 -0.362778
N  0.594535 -0.452053 0.054634
N  6.398529 1.416614 0.522403
C  -0.803313 -0.27034 0.006527
C  -3.580748 -0.062384 -0.060465
C  3.01118 -0.039229 -0.082893
C  -1.41328 0.984818 -0.287799
C  -1.618461 -1.413115 0.262609
C  -2.816136 1.088533 -0.31653
C  -3.018451 -1.317311 0.236375
C  1.609849 0.502079 -0.147616
C  4.035003 0.897989 0.177317
C  3.330868 -1.410009 -0.28951
C  5.394525 0.48995 0.259178
C  4.681482 -1.816094 -0.211452
C  5.704832 -0.890403 0.066514
H  -0.781329 1.853277 -0.47806
H  -1.152316 -2.380108 0.485716
H  0.912755 -1.391795 0.302555
H  -3.300629 2.04327 -0.543596
H  -3.65249 -2.188417 0.425913
H  3.752895 1.948847 0.308007
H  2.569482 -2.147242 -0.569618
H  4.942152 -2.866463 -0.38126
H  6.746981 -1.226878 0.124349
H  6.178671 2.400546 0.647653
H  7.372131 1.132128 0.575776
