program: Gaussian 09
title: 000270817
version: EM64L-G09RevD.01
frameworkgroup: C1[X(C18H19FN6O3S)]
method: RPBEPBE
basis: SDD
operation: Freq
keyword: #p
keyword: freq=noraman
keyword: PBEPBE/SDD
title: #p freq=noraman PBEPBE/SDD
converged: YES YES NO NO
title: Mulliken charges:
elementType: S F O O O N N N N N N C C C C C C C C C C C C C C C C C C H H H H H H H H H H H H H H H H H H H
charge: 1.082383 -0.345335 -0.259942 -0.483575 -0.474483 -0.308956 -0.083635 -0.159453 -0.624180 -0.611074 -0.489938 0.189876 -0.724747 -0.674410 0.372250 0.209003 -0.363172 -0.382544 -0.016059 0.271873 -0.348327 -0.352150 0.136496 0.538755 -0.456187 -0.049248 -0.340678 -0.260678 -0.185032 0.248771 0.238344 0.218258 0.239069 0.195735 0.238753 0.271446 0.253858 0.276688 0.214245 0.340741 0.342329 0.325024 0.321119 0.325602 0.280680 0.324145 0.289625 0.248734
chargesum: 0.00000
title: Mulliken charges with hydrogens summed into heavy atoms:
elementType: S F O O O N N N N N N C C C C C C C C C C C C C C C C C C
charge: 1.082383 -0.345335 -0.259942 -0.483575 -0.474483 -0.308956 -0.083635 -0.159453 0.058890 0.035068 -0.164336 0.189876 -0.019374 -0.000852 0.372250 0.209003 -0.091726 -0.128686 -0.016059 0.271873 -0.071639 -0.137906 0.136496 0.538755 -0.175507 -0.049248 -0.016533 0.028947 0.063702
polarizability: 5.55858409e+02 1.76575274e+01 2.72922368e+02 4.75286865e+00 -1.13031222e-01 1.60418098e+02
1716.lowfreq: -4.7551 -0.0005 0.0007 0.0019 2.7929 4.2998 12.5464 18.0059 25.0236
frequency: 12.5333 17.9742 25.0155 31.6675 48.1736 55.6647 65.7011 76.4968 98.9857 106.4740 119.8832 139.8818 144.5016 154.3316 189.0120 200.3995 212.8302 220.5897 231.4800 240.9102 248.7905 258.4077 283.2310 302.1405 309.2730 314.8725 316.5285 326.5105 348.9251 365.2932 394.5047 396.0331 402.6567 412.5406 432.7447 434.9580 444.0410 465.3866 485.4493 502.6744 518.7872 520.7935 530.4963 538.4200 553.1073 562.2670 572.3305 583.4710 629.8598 633.3073 641.5651 656.9435 667.2815 680.9355 692.8271 720.4541 725.5913 758.9064 799.6552 808.9550 827.2241 839.0727 854.4251 861.1452 865.5137 873.3726 879.7336 914.7841 928.0787 932.9187 945.3121 962.0833 969.6896 990.7399 993.8277 994.3741 1004.8068 1009.6205 1031.1034 1058.0673 1089.1962 1091.3101 1105.7164 1124.6530 1125.9690 1132.0611 1178.5648 1190.4249 1195.6237 1236.9177 1248.4511 1253.7257 1284.7767 1302.5565 1310.7978 1357.1332 1364.6986 1372.6145 1392.8321 1402.4158 1413.8310 1421.3232 1427.5498 1448.7390 1462.6985 1467.6715 1475.1207 1478.3603 1491.9768 1506.2350 1541.0558 1553.3700 1568.8239 1572.3324 1603.5232 1608.8980 1616.5092 1620.2436 1623.8240 2984.2777 3007.1106 3081.7592 3097.0049 3109.7996 3113.2387 3115.6182 3137.9461 3149.4508 3156.9777 3166.9592 3170.6090 3179.0395 3197.6822 3535.7664 3550.3512 3566.5121 3703.9834 3727.6244
redmass: 5.3374 9.4586 7.5777 6.1973 5.2696 5.9031 5.4894 5.3044 6.7365 6.6924 5.6197 5.3405 5.9058 5.1574 5.6238 6.2832 7.3689 1.2930 4.3641 7.9633 1.8663 1.6421 3.3476 5.3121 3.6063 2.9878 9.3861 4.3483 4.9592 3.5387 1.2372 1.3102 5.6450 2.8899 4.9240 2.9735 4.1831 4.5327 3.0442 2.6895 5.5653 1.3019 1.3569 5.9989 2.5295 4.8808 5.5923 5.1211 5.3719 4.8072 1.5700 5.3959 8.1026 2.4453 3.9735 8.5110 6.6136 4.6703 1.3037 3.8199 2.0425 3.3564 1.9831 6.9910 7.4487 2.1969 1.5663 1.5653 4.9677 1.3534 1.8350 1.4485 5.4543 1.3852 14.7069 1.3387 2.9174 1.3359 3.4979 2.9098 2.0796 1.7716 1.8738 2.0533 1.4663 2.0139 1.0930 1.6546 1.8385 3.6306 2.5955 1.9168 3.9574 1.4236 1.5177 4.5831 3.7479 1.2364 1.3809 3.1306 5.0143 4.2773 3.9424 1.0575 1.0653 1.0647 2.5333 1.0732 2.4495 2.5303 2.8545 4.6173 3.9763 2.0090 4.1182 3.7139 3.3800 5.3869 2.2772 1.0351 1.0356 1.0997 1.0997 1.1001 1.0897 1.0993 1.0926 1.0883 1.0888 1.0949 1.0959 1.0960 1.0959 1.0761 1.0446 1.0439 1.1052 1.1058
irintensity: 0.4720 0.1602 0.5788 0.3181 0.0942 3.9787 5.1466 8.6858 0.7110 0.9339 4.0659 3.4808 0.6733 1.8470 5.8631 7.0665 2.6094 1.9589 1.7077 3.4736 0.9851 2.0612 5.4313 10.4272 8.8943 2.2443 7.5964 1.1435 6.6815 8.3395 71.3632 269.8772 8.8884 2.6519 42.5837 77.2168 39.7784 2.9066 56.8456 6.4452 5.3437 15.1051 107.5645 93.6894 29.7586 3.7776 26.9525 23.7551 5.3998 21.3595 28.4158 14.6855 32.8205 34.9333 27.9721 14.9993 9.2108 13.6397 53.8269 85.6343 7.5831 34.9516 39.6211 27.8044 52.6339 5.4722 45.6629 2.0159 8.2272 3.2113 11.3005 0.1275 8.8812 7.1326 91.6210 1.0429 3.3765 3.6385 9.5782 7.3539 49.1610 35.2392 2.0217 11.5207 21.7439 52.7838 0.0439 142.3592 75.4824 48.6135 413.5749 13.2813 314.3619 145.7081 69.4386 13.0402 276.4077 33.2431 48.9852 353.7791 277.1276 208.5179 9.4062 9.6496 4.4714 8.1902 116.2631 8.3284 616.5962 145.2522 322.6478 10.9683 281.4335 71.4812 788.4727 271.9220 105.7676 115.1333 316.5266 19.0824 13.9232 30.5137 14.6379 21.7263 28.6641 21.3847 10.6074 2.2675 9.1255 5.5238 4.3265 10.9521 12.6934 11.8734 63.7052 124.6797 51.4034 40.8987
temp: 298.150 k
press: 1.00000 atm
elementType: 16 9 8 8 8 7 7 7 7 7 7 6 6 6 6 6 6 6 6 6 6 6 6 6 6 6 6 6 6 1 1 1 1 1 1 1 1 1 1 1 1 1 1 1 1 1 1 1
symmnumber: 1
zpe: 937773.9 jmol-1
zpe.correction: 0.357179 hartree
zpe.thermalcorrener: 0.385335 hartree
zpe.thermalcorrenthalpy: 0.386279 hartree
zpe.thermalcorrgfe: 0.296270 hartree
zpe.sumelectzpe: -1747.167601 hartree
zpe.sumelectthermal: -1747.139446 hartree
zpe.sumelectthermalent: -1747.138502 hartree
zpe.sumelectthermalfe: -1747.228511 hartree
dipole: -5.7695 3.5341 0.8038
dipole: 6.8134
quadrupole: -212.9319 -180.5315 -180.8855
quadrupole: 18.7502 -8.8685 1.9208
quadrupole: -21.4822 10.9181 10.5641 18.7502 -8.8685 1.9208
hfenergy: -1747.5247806 hartree
pointgroup: C01 [X(C18H19F1N6O3S1)]
dipole: 2.2215364 -1.2876932 0.7695797 debye
polarizability: 556.6368696|10.4982785|263.2349476|1.5883483|-30.278453|169.3270579 unknown
InChI: InChI=1S/C18H19FN6O3S/c1-18(2)24-16(20)23-17(21)25(18)13-8-6-11(7-9-13)15(26)22-12-4-3-5-14(10-12)29(19,27)28/h3-10,22H,20-21H2,1-2H3
charge 0 multiplicity 1
48 atoms
S  -6.943101 1.61885 -0.790847
F  -7.129151 2.245743 0.948791
O  -1.54034 -2.832827 0.285838
O  -6.071356 2.73144 -1.557398
O  -8.417563 1.199278 -1.267883
N  4.207366 0.199507 0.165223
N  6.115223 1.013194 -1.197086
N  6.470127 -0.321455 0.826739
N  4.691119 -1.146022 2.079223
N  8.199289 0.057797 -0.693523
N  -2.297846 -0.650679 -0.135892
C  4.760398 1.34888 -0.725538
C  3.874879 1.518025 -1.97501
C  4.821572 2.650517 0.119762
C  2.839618 -0.210072 0.160135
C  5.151424 -0.41438 1.003787
C  2.505716 -1.581751 -0.044143
C  1.783622 0.722545 0.357544
C  6.873177 0.291365 -0.383658
C  0.109494 -1.064717 0.122342
C  1.165901 -1.999058 -0.05112
C  0.440993 0.30122 0.333513
C  -1.290333 -1.601545 0.106295
C  -3.699277 -0.843399 -0.132398
C  -4.512536 0.288731 -0.412423
C  -5.900516 0.112729 -0.404946
C  -4.321368 -2.096779 0.141091
C  -6.559037 -1.097569 -0.141249
C  -5.727026 -2.208105 0.130947
H  4.391267 2.226918 -2.642138
H  3.77915 0.558072 -2.509976
H  2.871024 1.911363 -1.747402
H  5.290463 3.445872 -0.484723
H  3.816633 2.991181 0.429576
H  5.440287 2.494178 1.021228
H  3.310601 -2.304952 -0.209066
H  2.019795 1.770084 0.563576
H  0.904818 -3.051284 -0.202849
H  -0.334293 1.04907 0.543598
H  5.392946 -1.616734 2.645439
H  3.715956 -1.136996 2.365519
H  8.747685 -0.543665 -0.086408
H  8.592971 0.468951 -1.53485
H  -1.982669 0.291751 -0.374768
H  -4.078984 1.270188 -0.637373
H  -3.689288 -2.962113 0.346585
H  -7.64966 -1.173041 -0.157266
H  -6.18537 -3.179709 0.340282
