program: Gaussian 09
title: 000270812
version: EM64L-G09RevD.01
frameworkgroup: C1[X(C4H9BrO2)]
method: RPBEPBE
basis: SDD
operation: Freq
keyword: #p
keyword: freq=noraman
keyword: PBEPBE/SDD
title: #p freq=noraman PBEPBE/SDD
converged: YES YES NO NO
title: Mulliken charges:
elementType: Br O O C C C C H H H H H H H H H
charge: -0.041381 -0.434231 -0.432131 -0.091540 -0.335185 -0.371477 -0.668526 0.217329 0.256827 0.221546 0.227807 0.207855 0.294322 0.274813 0.332450 0.341522
chargesum: 0.00000
title: Mulliken charges with hydrogens summed into heavy atoms:
elementType: Br O O C C C C
charge: -0.041381 -0.101781 -0.090609 0.125789 0.143188 0.064185 -0.099391
polarizability: 8.74100463e+01 5.64985446e+00 5.51596353e+01 6.45275032e+00 2.84859734e-01 5.27242803e+01
1716.lowfreq: -5.0134 -0.0006 -0.0005 -0.0004 7.5677 12.9731 58.4686 99.8698 110.7629
frequency: 58.4580 99.8626 110.7469 139.1259 192.6341 264.0649 310.9958 342.8393 403.5787 442.9851 489.1099 627.8559 766.3562 842.9978 909.7439 961.5603 988.5388 1032.2730 1067.6881 1076.1645 1125.3108 1139.5533 1224.3021 1245.5760 1290.1037 1304.7732 1322.5617 1352.5252 1368.5503 1373.2332 1454.9389 1465.5049 1467.8956 2985.5282 2989.2595 3019.2392 3057.4816 3062.4984 3067.3060 3144.4655 3542.5408 3567.6119
redmass: 4.7567 2.2532 5.2752 2.3982 7.1683 3.7500 1.1317 1.0841 4.8967 2.6596 3.2334 4.7563 1.2400 2.3478 1.6793 3.3247 1.9046 3.2091 2.3504 1.4403 1.6750 1.2716 1.2352 1.3213 1.1876 1.1889 1.3483 1.4309 1.2262 1.1785 1.0984 1.0841 1.0873 1.0606 1.0640 1.0846 1.0582 1.1002 1.1014 1.1105 1.0659 1.0665
irintensity: 0.2270 0.4770 5.9124 6.4818 2.9652 29.3809 171.6162 112.7004 59.3096 34.5796 6.1403 15.7921 3.4600 27.1591 0.8093 55.2889 72.6756 21.8916 7.9204 47.5914 8.0515 33.6489 5.7340 25.7832 15.7777 10.9523 11.1693 20.7920 2.6855 40.4789 2.4202 12.2035 4.7061 45.8517 15.4071 18.2719 12.8647 7.7404 49.3471 9.0255 6.7070 7.6066
temp: 298.150 k
press: 1.00000 atm
elementType: 35 8 8 6 6 6 6 1 1 1 1 1 1 1 1 1
symmnumber: 1
zpe: 339131.4 jmol-1
zpe.correction: 0.129168 hartree
zpe.thermalcorrener: 0.138224 hartree
zpe.thermalcorrenthalpy: 0.139168 hartree
zpe.thermalcorrgfe: 0.093526 hartree
zpe.sumelectzpe: -321.118253 hartree
zpe.sumelectthermal: -321.109198 hartree
zpe.sumelectthermalent: -321.108253 hartree
zpe.sumelectthermalfe: -321.153896 hartree
dipole: 2.5269 0.6462 0.5339
dipole: 2.6623
quadrupole: -55.7376 -59.5733 -46.8713
quadrupole: 0.1388 2.1630 -5.8890
quadrupole: -1.6769 -5.5126 7.1895 0.1388 2.1630 -5.8890
hfenergy: -321.2474218 hartree
pointgroup: C01 [X(C4H9Br1O2)]
dipole: 0.9743943 0.374285 -0.0868131 debye
dipolederiv: -0.6013166 -0.0752134 0.0747833 -0.1787634 -0.204012 0.0193746 0.0200836 -0.0060942 -0.161106 -0.7006046 0.0680763 0.075231 0.0487264 -0.5596762 0.33367 0.112161 0.3408749 -0.3960119 -0.6753641 0.2259363 0.0122924 0.2980782 -0.458753 0.2737041 -0.0048346 0.2954123 -0.4636315 0.3541378 0.0450645 0.0031339 0.2539446 0.4485459 -0.2142005 0.0768331 -0.2140247 0.414485 -0.3407285 -0.0746212 0.1096468 -0.1883719 -0.116638 0.0795773 -0.0232145 -0.01555 0.0850449 0.3311102 -0.0803784 0.088831 -0.2257409 0.3349819 -0.1086013 0.11884 -0.1528328 0.4289587 0.8029816 0.243858 -0.0706622 0.2308198 0.2078483 0.0037242 -0.0273646 -0.0073092 0.1314925 0.0551408 -0.0008806 -0.0352249 -0.0276441 -0.0079277 -0.0628724 -0.0503655 -0.0481928 -0.128253 0.1259763 0.0072409 -0.0016819 0.0391111 -0.0261089 0.0618941 0.0062618 0.0848536 0.0296276 0.0534565 -0.0198907 -0.0098915 0.0197636 0.0683301 -0.0533751 -0.0134983 -0.0618279 -0.1307812 -0.1660014 -0.0836842 0.0510519 -0.0756238 -0.043421 0.0786972 0.0335771 0.0457308 0.0331178 0.0686308 -0.0116944 -0.0893346 0.0103765 0.0149047 -0.0748651 -0.0363821 -0.0506803 -0.1050271 -0.0181698 -0.0648153 0.0013807 0.0036125 -0.05662 0.0438396 -0.0328887 0.0709405 0.0657537 -0.04787 -0.0770509 -0.0669509 -0.0527687 0.0471815 -0.0515832 -0.0091976 -0.0559206 -0.0711728 0.3722001 -0.03066 -0.084952 -0.0378176 0.186996 -0.1882651 -0.0896732 -0.126379 0.1249175 0.386421 -0.071287 -0.057653 -0.1177024 0.1643686 -0.1407183 -0.0803374 -0.0990005 0.1425859 unknown
polarizability: 86.6267334|9.4214739|55.8112889|-2.2616216|-2.1945158|52.8559395 unknown
InChI: InChI=1S/C4H9BrO2/c5-2-1-4(7)3-6/h4,6-7H,1-3H2
charge 0 multiplicity 1
16 atoms
Br -3.488769 -0.682421 0.567783
O  0.597249 1.440438 -1.051804
O  2.193018 -1.62238 0.497234
C  0.711477 0.304599 -0.111187
C  -0.602086 -0.503611 -0.022707
C  1.915801 -0.583375 -0.505144
C  -1.723517 0.331727 0.595322
H  0.923349 0.802105 0.854726
H  -0.418558 -1.413595 0.577515
H  -0.892844 -0.837964 -1.038935
H  2.796113 0.066814 -0.682787
H  1.694152 -1.144921 -1.430951
H  -1.918903 1.258944 0.036882
H  -1.551118 0.553157 1.660018
H  0.36121 1.085999 -1.94811
H  2.587727 -1.200917 1.301843
