program: Gaussian 09
title: 000270811
version: EM64L-G09RevD.01
frameworkgroup: C1[X(C15H9ClN2O)]
method: RPBEPBE
basis: SDD
operation: Freq
keyword: #p
keyword: freq=noraman
keyword: PBEPBE/SDD
title: #p freq=noraman PBEPBE/SDD
converged: NO YES NO NO
title: Mulliken charges:
elementType: Cl O N N C C C C C C C C C C C C C C C H H H H H H H H H
charge: -0.043609 -0.365145 -0.248242 -0.044624 0.180353 0.236970 0.169365 0.100450 0.333486 -0.367438 -0.383125 -0.367268 -0.367565 -0.208462 -0.241082 -0.218462 -0.222259 -0.251429 -0.114965 0.257313 0.254874 0.263998 0.286488 0.230315 0.230678 0.262782 0.259313 0.377289
chargesum: 0.00000
title: Mulliken charges with hydrogens summed into heavy atoms:
elementType: Cl O N N C C C C C C C C C C C C C C C
charge: -0.043609 0.012145 -0.248242 -0.044624 0.180353 0.236970 0.169365 0.100450 0.333486 -0.110125 -0.128251 -0.103270 -0.081077 0.021853 -0.010404 0.044320 0.037054 -0.251429 -0.114965
polarizability: 3.49306719e+02 9.16858734e-01 1.97575437e+02 1.05461647e+00 5.37759547e+00 8.14330043e+01
1716.lowfreq: -8.7129 -4.1607 -1.0752 -0.0005 0.0010 0.0012 37.7999 53.1101 63.5300
frequency: 37.7945 53.1079 63.5287 105.9533 116.8805 123.5442 132.4697 207.2656 222.6359 251.0870 253.5482 273.7944 278.5502 327.3652 357.9547 408.1562 434.7136 438.4190 450.1386 473.7416 483.9054 520.4576 544.9012 567.1160 619.2717 623.9742 669.1693 678.9854 707.1854 719.0114 753.2149 766.7129 815.7480 830.1925 838.2683 847.7931 863.9839 947.6255 961.1820 972.2653 983.9947 990.4651 997.6275 1010.0581 1064.3143 1080.1011 1116.1031 1122.3796 1168.3219 1198.5079 1208.2353 1232.5885 1276.1324 1304.2850 1322.2048 1350.8184 1386.0140 1390.3474 1407.6730 1414.5594 1447.8610 1471.2858 1478.6917 1531.1518 1572.6082 1586.5756 1601.4297 1627.4071 2170.2627 3137.2641 3149.3817 3159.9023 3163.5751 3163.5917 3175.3594 3178.8541 3184.7692 3432.9803
redmass: 8.0996 4.4511 7.6183 7.7497 9.1918 4.8932 6.6348 6.0625 9.5870 4.1994 6.7849 1.2728 7.7006 5.7879 5.3770 2.9315 5.7348 3.9762 9.0008 9.6249 4.6667 4.8795 7.1536 4.1496 7.4974 7.4202 6.2199 6.8796 6.9239 3.8505 2.0112 2.0320 3.3192 1.3023 3.3168 2.7729 1.4114 1.3705 1.3461 1.3697 1.3159 8.2116 4.4810 2.1239 5.5950 2.3814 1.5002 1.4643 1.1260 1.1521 4.0143 2.2150 2.2020 1.2701 1.8979 4.0124 2.2694 3.7456 4.0567 3.8035 3.7306 2.9071 3.2042 7.3047 7.5588 7.0952 6.0563 7.9099 12.6063 1.0857 1.0903 1.0889 1.0902 1.0949 1.0996 1.0968 1.0972 1.0683
irintensity: 0.3616 0.4679 0.8885 3.1827 1.8243 7.3238 0.1543 5.6468 2.8183 9.3731 4.7158 98.2032 28.7873 0.8468 0.7204 0.7108 3.8440 8.1596 15.9878 1.2085 16.6561 8.8620 0.9865 2.3449 0.5766 0.5851 0.7352 0.2209 22.9970 0.7427 51.2435 59.4484 30.4421 0.7159 18.6516 22.8776 0.1560 3.0580 0.3056 0.4923 0.1447 10.3839 38.7602 13.0273 11.1696 46.5379 3.3956 4.0184 0.8476 0.8692 7.6029 33.0584 13.3791 0.3592 7.9210 5.2800 0.5013 10.1191 20.2601 63.1334 20.0046 51.6071 10.9410 25.7292 2.9630 2.0367 18.1075 0.7772 75.7012 1.9182 6.6482 1.5590 6.8369 9.4661 22.0984 1.7420 0.9219 13.3214
temp: 298.150 k
press: 1.00000 atm
elementType: 17 8 7 7 6 6 6 6 6 6 6 6 6 6 6 6 6 6 6 1 1 1 1 1 1 1 1 1
symmnumber: 1
zpe: 520371.3 jmol-1
zpe.correction: 0.198199 hartree
zpe.thermalcorrener: 0.214015 hartree
zpe.thermalcorrenthalpy: 0.214959 hartree
zpe.thermalcorrgfe: 0.154220 hartree
zpe.sumelectzpe: -1220.444076 hartree
zpe.sumelectthermal: -1220.428261 hartree
zpe.sumelectthermalent: -1220.427316 hartree
zpe.sumelectthermalfe: -1220.488055 hartree
dipole: -1.8817 -5.0123 2.1138
dipole: 5.7560
quadrupole: -111.2687 -121.1768 -116.5927
quadrupole: 2.9050 -0.6977 -0.0743
quadrupole: 5.0774 -4.8307 -0.2467 2.9050 -0.6977 -0.0743
hfenergy: -1220.6422753 hartree
pointgroup: C01 [X(C15H9Cl1N2O1)]
dipole: -0.7482819 2.1368992 -0.0453429 debye
polarizability: 349.3138279|0.0723634|177.9942078|-0.8355214|43.8085607|101.0071247 unknown
InChI: InChI=1S/C15H9ClN2O/c16-11-7-5-10(6-8-11)15-13(9-17)12-3-1-2-4-14(12)18(15)19/h1-8,19H
charge 0 multiplicity 1
28 atoms
Cl 6.098765 0.219122 0.046508
O  -0.393362 2.474596 0.700332
N  -0.843027 1.188019 0.290698
N  -0.243533 -3.395535 -1.107839
C  -0.013281 0.103429 -0.048725
C  -2.202291 0.862432 0.211299
C  -2.259133 -0.502876 -0.223607
C  -0.888975 -0.96396 -0.382295
C  1.455272 0.160342 -0.029053
C  -3.35028 1.63674 0.469924
C  -3.52454 -1.116288 -0.402813
C  2.208789 -0.642135 -0.932852
C  2.157989 0.977605 0.904384
C  -4.59539 1.003368 0.282932
C  -4.681051 -0.35486 -0.148023
C  3.617478 -0.63048 -0.913299
C  3.567114 0.997401 0.929875
C  -0.513108 -2.27779 -0.770308
C  4.279062 0.193772 0.017879
H  -3.274501 2.671847 0.814384
H  -3.594484 -2.158695 -0.730557
H  1.696933 -1.275762 -1.662919
H  1.603555 1.58414 1.62452
H  -5.516784 1.562892 0.476733
H  -5.668276 -0.810123 -0.279549
H  4.186808 -1.249299 -1.612062
H  4.100457 1.619779 1.653784
H  -0.198705 2.982117 -0.138753
