program: Gaussian 09
title: 000026084
version: EM64L-G09RevD.01
frameworkgroup: C1[X(C14H23NO4)]
method: RPBEPBE
basis: SDD
operation: Freq
keyword: #p
keyword: freq=noraman
keyword: PBEPBE/SDD
title: #p freq=noraman PBEPBE/SDD
converged: YES YES NO NO
title: Mulliken charges:
elementType: O O O O N C C C C C C C C C C C C C C H H H H H H H H H H H H H H H H H H H H H H H
charge: -0.298740 -0.288804 -0.287351 -0.294978 -0.093888 -0.365390 -0.240375 0.461960 -0.358599 -0.557327 -0.580640 0.295649 0.252400 0.044673 -0.613995 -0.612758 -0.533248 -0.499583 -0.522538 0.223116 0.192044 0.205744 0.188413 0.202806 0.204882 0.254355 0.289644 0.188860 0.223937 0.222154 0.221407 0.187612 0.228221 0.238628 0.229160 0.223370 0.252551 0.201656 0.223783 0.226687 0.264449 0.200053
chargesum: 0.00000
title: Mulliken charges with hydrogens summed into heavy atoms:
elementType: O O O O N C C C C C C C C C C C C C C
charge: -0.298740 -0.288804 -0.287351 -0.294978 -0.093888 0.049770 0.153783 0.461960 0.049088 -0.302971 -0.290996 0.295649 0.252400 0.044673 0.020956 0.024482 0.157910 0.178406 0.168651
polarizability: 2.42785791e+02 -4.58299073e+00 1.87016527e+02 6.37494415e+00 3.02968339e-01 1.15474114e+02
1716.lowfreq: -28.1749 -6.0026 -4.8858 0.0006 0.0010 0.0010 6.4747 12.6301 35.8908
frequency: -26.0940 12.4886 35.8588 45.2620 53.6723 63.2751 85.4402 104.3467 111.3834 115.8174 132.4275 154.5406 173.2018 181.4416 190.3096 192.0638 208.8887 214.7405 221.5198 236.7666 264.4026 275.5646 307.6791 308.4513 351.9280 369.0167 384.2736 425.0189 440.8301 466.2673 474.6367 525.9116 577.7516 583.9850 620.4814 642.9859 723.9766 751.6651 810.0915 819.0784 849.6505 864.2342 867.7064 931.5573 944.4041 951.1114 1010.9606 1014.9918 1031.1320 1033.9038 1060.6575 1067.6666 1074.8328 1088.7972 1097.4891 1106.0347 1109.8852 1113.3990 1126.3645 1138.9135 1153.2350 1155.2520 1159.3574 1167.0949 1192.1554 1204.7406 1218.7871 1237.7739 1265.6257 1284.7738 1309.7234 1316.5324 1351.3506 1379.8201 1397.5270 1407.6032 1418.3822 1419.8288 1440.6244 1441.9790 1445.5128 1451.1023 1453.0011 1460.1877 1465.1141 1465.1465 1466.4429 1470.5105 1472.4191 1475.0303 1477.5211 1482.5229 1484.6387 1485.1173 1490.3319 1585.8418 1612.9157 2847.1837 2855.7245 2876.3160 2903.1782 2931.2821 2949.2158 2961.3045 2965.1057 2973.3467 2990.4095 3018.9979 3027.6311 3047.8375 3054.4964 3074.8272 3078.2852 3083.5835 3084.8057 3120.4362 3121.4650 3121.7721 3146.9033 3190.2070
redmass: 2.5362 3.7746 3.8101 3.0028 2.5564 2.9087 3.1202 3.3106 2.7370 1.9781 3.3569 1.4086 1.7635 2.4195 2.0311 2.7873 1.1098 1.3657 2.1513 3.3216 1.9941 2.1594 3.4115 5.1414 2.5135 3.7207 3.5416 4.0575 3.6807 4.6001 3.5791 6.0863 3.9703 4.6956 4.6693 4.4799 4.7474 3.8822 1.4831 2.3658 1.4967 3.8172 1.7010 6.3066 7.4488 8.1883 1.7549 5.2466 2.3325 1.5364 4.2270 1.7895 4.5051 1.3733 2.5607 1.2561 1.2445 1.2616 2.5217 1.4640 1.3684 1.5377 1.5004 1.3811 2.0754 1.1055 1.4779 1.7447 2.4977 1.2426 1.6530 2.9042 1.7535 3.7714 1.9910 1.5015 1.1557 1.2404 1.2756 1.1704 1.2949 1.1387 1.1300 1.0508 1.0870 1.0506 1.1227 1.3440 1.0581 1.0525 1.0889 1.6551 1.0587 1.0866 1.0775 7.7273 6.7932 1.0571 1.0603 1.0671 1.0573 1.0578 1.1011 1.0368 1.0325 1.0349 1.1020 1.0723 1.0721 1.0913 1.1040 1.0938 1.1008 1.0962 1.1006 1.1053 1.1031 1.1020 1.0917 1.0903
irintensity: 0.3372 0.2042 0.2487 5.2068 7.4253 5.4118 1.2919 8.8337 6.3924 1.1906 2.8186 0.0951 1.8955 0.1390 0.7237 2.2156 0.9889 0.9743 1.9703 1.9794 3.6833 3.6163 0.9583 2.5032 11.0481 8.4514 1.7796 0.1004 8.9028 3.1755 0.9785 8.4195 9.4522 1.2814 5.9276 5.9467 4.0592 11.0849 10.8460 11.6285 53.7171 10.4521 4.4647 4.3732 3.5286 58.0355 2.5227 75.1410 51.9037 14.0886 271.7365 87.3927 64.3877 9.9103 5.6804 8.3412 7.5340 0.8729 44.6738 1.8623 12.9029 7.3423 39.8779 7.2395 33.6993 7.0801 60.3134 8.0168 12.4927 4.2591 8.0085 118.3259 21.9845 20.1813 46.5047 60.1088 2.8634 4.0616 11.6598 5.5714 44.8353 17.3379 2.0799 14.6303 14.2366 11.7084 67.6411 45.1748 25.8369 13.8216 11.2759 46.5850 14.4050 10.1635 8.8000 115.8225 38.9247 70.6203 123.6687 148.8788 38.6518 84.6302 44.6034 89.6170 56.1242 88.1194 47.9469 45.0658 50.7399 29.9730 43.4971 39.3785 34.0948 52.2954 49.8223 21.7307 6.6010 36.6182 4.7515 3.0095
temp: 298.150 k
press: 1.00000 atm
elementType: 8 8 8 8 7 6 6 6 6 6 6 6 6 6 6 6 6 6 6 1 1 1 1 1 1 1 1 1 1 1 1 1 1 1 1 1 1 1 1 1 1 1
symmnumber: 1
zpe: 919515.4 jmol-1
zpe.correction: 0.350225 hartree
zpe.thermalcorrener: 0.372041 hartree
zpe.thermalcorrenthalpy: 0.372985 hartree
zpe.thermalcorrgfe: 0.297548 hartree
zpe.sumelectzpe: -901.331790 hartree
zpe.sumelectthermal: -901.309974 hartree
zpe.sumelectthermalent: -901.309030 hartree
zpe.sumelectthermalfe: -901.384467 hartree
dipole: -1.8541 1.8098 1.2319
dipole: 2.8689
quadrupole: -98.8747 -106.3961 -116.3845
quadrupole: -0.1134 12.9981 0.8301
quadrupole: 8.3437 0.8223 -9.1661 -0.1134 12.9981 0.8301
hfenergy: -901.6820153 hartree
pointgroup: C01 [X(C14H23N1O4)]
dipole: -0.6916863 0.4407343 0.7754504 debye
polarizability: 239.2916007|-17.4747019|169.9358439|9.0737059|31.2608446|136.0489875 unknown
InChI: InChI=1S/C14H23NO4/c1-15(2)6-7-19-10-11-8-12(16-3)14(18-5)13(9-11)17-4/h8-9H,6-7,10H2,1-5H3
charge 0 multiplicity 1
42 atoms
O  -2.216926 -0.165532 -0.087533
O  2.232656 1.870257 1.190859
O  3.393669 -2.31495 -1.09449
O  4.214126 0.156103 0.268576
N  -5.900377 0.452104 0.177214
C  -4.445286 0.602485 0.413675
C  -3.626691 -0.386368 -0.428507
C  0.120037 -0.755405 -0.467918
C  -1.32498 -1.064314 -0.821239
C  1.135383 -1.639549 -0.876283
C  0.452372 0.419114 0.244767
C  1.805628 0.705541 0.524173
C  2.495525 -1.365697 -0.586721
C  2.851177 -0.178027 0.113929
C  -6.344652 1.031676 -1.107264
C  -6.712389 0.945241 1.308066
C  1.209434 2.862595 1.528248
C  4.700516 -2.531811 -0.451587
C  4.697785 0.335602 1.653675
H  -4.237423 0.388867 1.477749
H  -4.082585 1.641241 0.20993
H  -3.933337 -1.425877 -0.185931
H  -3.779024 -0.222759 -1.518281
H  -1.487425 -0.933142 -1.916479
H  -1.564467 -2.122823 -0.574061
H  0.911088 -2.565486 -1.416492
H  -0.356767 1.079492 0.561225
H  -6.201332 2.141724 -1.159974
H  -7.418038 0.817927 -1.256796
H  -5.793172 0.577306 -1.948025
H  -7.77899 0.725146 1.120539
H  -6.616017 2.047728 1.48145
H  -6.415785 0.425359 2.236104
H  1.759853 3.696072 1.989801
H  0.683019 3.21611 0.621242
H  0.472622 2.455312 2.247175
H  5.392943 -1.703587 -0.667235
H  4.590548 -2.646245 0.64445
H  5.06719 -3.474947 -0.8875
H  5.770205 0.566312 1.557095
H  4.166774 1.167753 2.143845
H  4.563017 -0.597645 2.23703
