program: Gaussian 09
title: 000270796
version: EM64L-G09RevD.01
frameworkgroup: C1[X(C20H20O2)]
method: RPBEPBE
basis: SDD
operation: Freq
keyword: #pfreq=noraman
keyword: PBEPBE/SDD
title: #p freq=noraman PBEPBE/SDD
converged: YES YES NO NO
title: Mulliken charges:
elementType: O O C C C C C C C C C C C C C C C C C C C C H H H H H H H H H H H H H H H H H H H H
charge: -0.434480 -0.422958 0.018078 0.100559 0.102375 0.135692 0.272904 0.250454 0.173806 -0.556765 0.226579 -0.856628 -0.408724 -0.876079 -0.400231 -0.408158 -0.259965 -0.262179 -0.363105 -0.504615 -0.234360 -0.245403 0.229632 0.226892 0.219273 0.255194 0.248320 0.253331 0.291684 0.229149 0.232053 0.249798 0.251810 0.226488 0.226576 0.235303 0.238006 0.198212 0.233127 0.230460 0.343378 0.334517
chargesum: 0.00000
title: Mulliken charges with hydrogens summed into heavy atoms:
elementType: O O C C C C C C C C C C C C C C C C C C C C
charge: -0.091103 -0.088441 0.018078 0.100559 0.102375 0.135692 0.272904 0.250454 0.173806 -0.100241 0.226579 -0.133841 -0.155393 -0.123193 -0.150433 -0.156348 -0.033477 -0.035602 -0.127802 -0.068397 -0.001233 -0.014943
polarizability: 3.21793049e+02 -1.40834442e+01 2.12266648e+02 9.35256763e+00 7.51959441e+00 1.56935046e+02
1716.lowfreq: -8.0683 -4.4314 -0.0004 0.0005 0.0008 6.7264 32.2073 37.6008 51.2556
frequency: 32.1622 37.3979 51.1494 66.3484 77.5510 82.2525 122.4707 126.8354 138.2962 152.3039 175.1639 186.4975 204.3638 224.0601 248.9014 277.6081 296.1977 312.2695 338.2567 342.7419 366.1548 371.4721 395.6360 406.5278 441.0956 468.0201 479.6972 510.0326 513.0144 546.0821 564.2443 589.4086 604.3283 607.1983 647.1773 657.4648 722.3951 753.1837 754.7170 767.9927 771.4554 807.6380 814.8572 820.8102 880.9169 884.5078 899.7349 919.9323 926.1016 955.2875 958.1768 961.6217 967.4083 990.9688 992.8600 1007.5049 1032.4179 1037.6304 1040.6936 1044.5989 1063.9967 1077.9240 1083.4440 1098.7511 1135.9348 1158.9801 1168.9875 1175.3235 1181.2025 1203.2403 1223.2890 1274.4801 1280.5199 1295.2798 1302.1405 1314.2529 1361.5321 1364.6497 1369.4027 1376.2810 1378.4452 1392.7328 1398.7911 1411.7382 1426.3857 1431.8641 1440.8220 1461.1726 1469.7297 1472.7255 1474.7295 1481.2797 1483.7687 1506.5281 1515.7206 1577.0971 1578.3972 1588.9337 1604.8502 1623.2806 2968.9931 2976.5342 2982.2964 3011.2260 3049.3942 3057.6916 3081.2514 3094.1639 3106.5348 3110.0830 3117.5248 3120.7544 3126.4271 3138.8834 3142.2997 3158.8906 3161.0343 3168.7627 3545.8243 3554.8438
redmass: 4.7500 4.8480 4.4183 4.1419 3.9543 4.4234 2.8722 3.9642 1.5555 1.8793 1.1603 3.0808 4.7724 3.8716 3.3994 2.1325 1.4923 1.6692 2.6158 2.8936 4.0798 2.8201 2.2139 2.7481 4.1619 4.5675 3.8099 4.0262 4.5708 4.3244 3.9592 4.0585 3.3440 4.3302 5.4947 5.3714 5.0475 3.0954 3.7229 1.3459 1.6307 2.8828 3.4872 3.2498 1.7461 1.5543 3.6173 3.9944 3.0057 1.4839 1.7321 1.3667 2.0850 1.3244 1.3298 2.5211 2.7507 1.5684 1.8673 1.8280 2.1083 3.5495 1.8162 1.9549 1.5287 1.1374 1.4096 1.0585 1.1039 2.3025 2.0878 1.6635 2.3801 2.1517 1.2664 1.2451 1.6019 4.9137 2.6275 2.5284 1.2798 1.3695 1.2803 2.6208 4.7681 2.4171 2.6848 1.1073 1.2155 1.1267 1.1398 1.1308 2.1950 1.6514 1.4816 7.1398 6.9483 6.0494 6.3690 6.2621 1.0696 1.0421 1.0389 1.0639 1.0955 1.0978 1.0998 1.0944 1.0959 1.0880 1.0886 1.0947 1.0852 1.0923 1.0893 1.0941 1.1003 1.0991 1.0663 1.0663
irintensity: 1.1896 0.1066 2.2207 1.6333 0.6236 0.8100 1.8410 0.2589 1.4299 0.3706 1.1091 1.2896 0.0698 3.4434 13.4617 46.5495 90.1716 73.8786 30.5074 14.6725 8.2085 37.1929 22.6463 8.9456 12.6291 1.1647 2.6093 2.0963 3.9937 1.7853 1.3989 18.7144 7.6720 0.7378 1.2496 3.7277 0.7596 29.7001 5.4891 78.9148 51.9278 1.5938 4.1050 4.6431 0.0715 1.5054 32.3696 102.6857 46.5075 1.0723 0.0899 1.1365 8.6703 0.0059 0.0813 3.3257 5.8888 3.8314 3.9006 5.0711 0.4485 19.2809 4.8979 2.0654 5.6327 24.6954 11.1593 1.6226 1.3907 8.0570 13.4938 3.7518 2.2618 2.8553 11.6060 21.3200 18.9232 1.7429 5.4245 33.9455 10.8177 12.8397 21.6674 8.2299 2.2929 3.9437 0.6836 5.0737 11.8162 16.4956 13.8931 5.4103 9.1321 12.3307 8.5385 0.9475 1.2928 12.5376 3.3902 0.6223 68.8444 33.1636 23.3550 49.4791 16.9030 12.1557 19.6830 12.8860 20.7347 14.0810 3.3590 6.9701 2.4306 19.4065 11.4244 28.6619 34.6936 31.1742 5.4353 3.8215
temp: 298.150 k
press: 1.00000 atm
elementType: 8 8 6 6 6 6 6 6 6 6 6 6 6 6 6 6 6 6 6 6 6 6 1 1 1 1 1 1 1 1 1 1 1 1 1 1 1 1 1 1 1 1
symmnumber: 1
zpe: 898849.0 jmol-1
zpe.correction: 0.342353 hartree
zpe.thermalcorrener: 0.362965 hartree
zpe.thermalcorrenthalpy: 0.363910 hartree
zpe.thermalcorrgfe: 0.293041 hartree
zpe.sumelectzpe: -923.006279 hartree
zpe.sumelectthermal: -922.985667 hartree
zpe.sumelectthermalent: -922.984723 hartree
zpe.sumelectthermalfe: -923.055592 hartree
dipole: -1.9648 -1.3760 -0.8873
dipole: 2.5576
quadrupole: -107.6570 -136.6245 -127.6309
quadrupole: 5.3089 0.8784 3.7504
quadrupole: 16.3138 -12.6537 -3.6601 5.3089 0.8784 3.7504
hfenergy: -923.3486328 hartree
pointgroup: C01 [X(C20H20O2)]
dipole: -0.7614561 0.5701765 0.3280104 debye
polarizability: 322.6407908|10.8308418|211.9300355|-7.7725921|6.5543606|156.4239169 unknown
InChI: InChI=1S/C20H20O2/c1-13-16-8-5-6-9-17(16)14(2)20(19(13)12-22)18-10-4-3-7-15(18)11-21/h3-10,21-22H,11-12H2,1-2H3
charge 0 multiplicity 1
42 atoms
O  -0.878844 -3.54139 0.371204
O  -1.642627 2.435949 -2.072485
C  -0.316753 -0.09299 0.115953
C  0.218913 -1.377801 -0.293975
C  0.533195 0.983431 0.427314
C  1.609844 -1.589022 -0.354814
C  1.96206 0.802033 0.30559
C  2.501732 -0.488209 -0.073663
C  -1.811424 0.049774 0.261918
C  -0.746238 -2.493899 -0.672679
C  -2.638696 0.536978 -0.794637
C  -0.015628 2.327285 0.874451
C  2.874818 1.880951 0.558526
C  2.186843 -2.953807 -0.698856
C  3.927017 -0.633062 -0.176267
C  -2.420212 -0.334698 1.485212
C  4.256147 1.708572 0.446214
C  4.788467 0.436689 0.075405
C  -4.042972 0.608039 -0.601413
C  -2.05367 1.009309 -2.114209
C  -3.818395 -0.245191 1.671597
C  -4.637661 0.224705 0.620736
H  -1.743155 -2.081547 -0.912659
H  -0.388374 -3.05284 -1.551578
H  0.471224 2.672443 1.805452
H  0.149899 3.096221 0.096973
H  -1.099082 2.278506 1.058309
H  2.479349 2.862628 0.834604
H  1.417399 -3.738103 -0.688625
H  2.676294 -2.950341 -1.692511
H  2.953145 -3.253761 0.039363
H  4.347511 -1.600182 -0.467351
H  -1.782158 -0.686109 2.305487
H  4.933105 2.548253 0.639002
H  5.872376 0.303647 -0.013988
H  -4.67641 0.959539 -1.426662
H  -1.12266 0.477841 -2.364674
H  -2.788082 0.858458 -2.932778
H  -4.26352 -0.544344 2.627087
H  -5.723794 0.285347 0.749828
H  -1.200767 -3.105999 1.201578
H  -2.415517 2.970292 -1.754677
