program: Gaussian 09
title: 000270791
version: EM64L-G09RevD.01
frameworkgroup: C1[X(C20H18Br2)]
method: RPBEPBE
basis: SDD
operation: Freq
keyword: #p
keyword: freq=noraman
keyword: PBEPBE/SDD
title: #p freq=noraman PBEPBE/SDD
converged: YES YES NO NO
title: Mulliken charges:
elementType: Br Br C C C C C C C C C C C C C C C C C C C C H H H H H H H H H H H H H H H H H H
charge: -0.066669 -0.055519 0.011549 0.084815 0.259307 0.280324 0.140379 0.258162 0.148132 -0.852466 -0.955679 -0.410751 0.369068 -0.398365 -0.858089 -0.363397 -0.256013 -0.260881 -0.343013 -0.906522 -0.230135 -0.242280 0.229450 0.239017 0.263216 0.326599 0.299871 0.255166 0.254304 0.237707 0.266559 0.241268 0.266743 0.229556 0.230065 0.240712 0.289687 0.310433 0.235095 0.232594
chargesum: 0.00000
title: Mulliken charges with hydrogens summed into heavy atoms:
elementType: Br Br C C C C C C C C C C C C C C C C C C C C
charge: -0.066669 -0.055519 0.011549 0.084815 0.259307 0.280324 0.140379 0.258162 0.148132 -0.120782 -0.329209 -0.155585 0.369068 -0.144061 -0.112555 -0.096654 -0.026457 -0.030817 -0.102301 -0.306402 0.004960 -0.009686
polarizability: 3.28800243e+02 3.02617996e+01 2.38436903e+02 -2.67970159e+01 1.21873191e+01 2.23547444e+02
1716.lowfreq: -8.4033 -3.2649 -1.3884 -0.0006 0.0003 0.0008 21.9735 29.1925 36.4365
frequency: 21.9063 28.8184 36.1543 46.8573 53.7857 78.5831 86.5100 103.9409 113.3837 133.2183 160.4399 172.9797 190.9384 195.4405 222.6556 282.5916 307.3059 319.7482 341.2186 360.6352 390.7867 400.0851 428.3807 432.2922 449.5092 479.0045 502.7955 521.6321 535.3915 552.3900 571.6239 583.2585 600.2629 618.3195 636.0045 654.7135 733.9606 746.6797 762.5351 769.4903 775.6195 801.9002 819.8669 826.3529 874.5983 884.6287 887.1888 896.7587 917.1840 961.8784 963.2726 993.2688 996.1283 1001.0608 1030.5912 1035.6560 1038.9097 1044.2688 1055.8482 1068.3845 1078.7142 1082.9799 1113.5349 1136.1967 1161.8899 1177.8165 1182.3798 1206.2096 1209.4062 1215.0628 1231.1144 1281.5220 1285.5735 1299.8286 1366.0759 1368.5793 1374.9929 1396.2354 1399.5625 1413.6346 1426.3870 1432.6210 1442.1187 1456.3779 1457.1577 1465.2011 1475.6948 1481.1684 1484.6944 1499.9482 1512.4722 1574.7457 1577.7642 1584.1426 1607.2830 1621.8553 2974.0572 2980.3447 3043.7536 3051.4377 3073.3581 3091.7312 3108.6544 3121.1957 3124.5320 3129.5897 3137.0575 3144.9278 3152.4269 3160.1611 3160.7881 3167.5642 3170.6583 3172.9499
redmass: 10.5762 6.9533 9.2810 5.8284 4.5488 4.7487 6.4309 1.4851 3.3821 2.4401 3.6760 4.7814 2.5559 1.2659 5.0702 3.8477 3.6849 3.9469 3.1589 3.0785 2.3968 3.2206 4.2640 4.6196 4.7096 5.0208 3.7293 5.1017 4.4277 4.8058 3.8890 4.0333 3.2484 4.5627 4.7898 5.9552 4.3476 3.9132 2.3560 1.3331 1.8721 3.2065 2.7034 3.3947 1.5209 1.7732 1.4815 1.7293 3.0037 1.3996 1.3649 1.3282 1.4113 2.3651 2.4570 1.5947 1.6661 2.1327 1.9270 2.2724 1.9930 1.7675 1.6379 1.2771 1.7076 1.0591 1.0911 1.1376 1.1460 2.2276 2.2777 2.7538 1.6575 2.0571 4.0744 5.5733 3.9614 1.3844 1.3001 2.5978 5.1464 2.3227 2.6038 1.1538 1.1488 1.1191 1.2217 1.0927 2.1855 1.2930 2.2427 6.5284 7.2915 5.8365 6.2666 6.1295 1.0406 1.0418 1.0967 1.0964 1.0574 1.0588 1.0952 1.0938 1.0873 1.0854 1.0887 1.0892 1.0942 1.1108 1.0941 1.1007 1.0994 1.1093
irintensity: 0.4444 0.7997 0.1741 0.5980 0.8389 0.1472 1.2327 0.9672 1.8023 0.5762 0.8897 0.5357 2.9401 2.7803 0.8982 2.3024 0.9724 10.7737 0.9814 3.7619 1.8448 1.8279 8.7447 4.8035 27.7299 18.3651 13.1690 10.5827 17.4965 32.2050 12.4617 25.2952 7.3586 10.4356 1.5568 0.3021 0.8454 5.3122 13.9112 83.3538 25.9355 22.2974 0.8544 10.3286 13.3558 0.1910 0.4665 0.9492 21.3574 1.1649 0.9067 0.0013 0.6582 3.0744 5.0431 1.4025 1.2108 5.7925 3.0450 2.6179 0.5191 1.5920 14.5080 2.6577 3.0287 0.3834 1.6905 42.2823 37.9670 14.4263 30.6680 2.0381 2.6336 3.6482 10.2948 4.3060 12.9638 1.4851 34.9769 4.9503 5.1456 3.8552 0.9624 13.4529 6.6598 9.2583 13.8435 8.5271 6.8661 13.0126 5.7235 2.8055 0.2242 17.6666 5.3878 3.0548 27.5899 21.7575 14.1518 11.6779 11.2670 5.7692 12.7358 13.0589 4.1854 1.8515 4.8707 9.6518 19.5270 3.0155 24.7937 25.9724 31.0750 1.4954
temp: 298.150 k
press: 1.00000 atm
elementType: 35 35 6 6 6 6 6 6 6 6 6 6 6 6 6 6 6 6 6 6 6 6 1 1 1 1 1 1 1 1 1 1 1 1 1 1 1 1 1 1
symmnumber: 1
zpe: 828687.4 jmol-1
zpe.correction: 0.315630 hartree
zpe.thermalcorrener: 0.336448 hartree
zpe.thermalcorrenthalpy: 0.337392 hartree
zpe.thermalcorrgfe: 0.262958 hartree
zpe.sumelectzpe: -798.334337 hartree
zpe.sumelectthermal: -798.313520 hartree
zpe.sumelectthermalent: -798.312575 hartree
zpe.sumelectthermalfe: -798.387010 hartree
dipole: -1.3617 -2.7673 -1.9150
dipole: 3.6304
quadrupole: -132.2860 -150.4481 -145.8093
quadrupole: -1.8124 -10.0220 8.4814
quadrupole: 10.5618 -7.6003 -2.9615 -1.8124 -10.0220 8.4814
hfenergy: -798.6499677 hartree
pointgroup: C01 [X(C20H18Br2)]
dipole: 0.4098736 1.3677734 0.0357075 debye
polarizability: 335.2350694|16.16813|246.7266716|22.7183935|6.3772509|208.8228485 unknown
InChI: InChI=1S/C20H18Br2/c1-13-16-8-5-6-9-17(16)14(2)20(19(13)12-22)18-10-4-3-7-15(18)11-21/h3-10H,11-12H2,1-2H3
charge 0 multiplicity 1
40 atoms
Br -1.09472 -3.225458 -1.981001
Br -2.077146 -1.014193 3.261162
C  -0.295359 0.110618 -0.193633
C  0.609064 1.186842 -0.1857
C  0.177341 -1.261973 -0.118916
C  2.025596 0.916035 -0.076969
C  1.557379 -1.545334 -0.038415
C  2.498675 -0.450367 -0.000344
C  -1.778094 0.369074 -0.288109
C  0.131924 2.626837 -0.288483
C  -0.837323 -2.363621 -0.10105
C  2.98727 1.980469 -0.042012
C  -2.559809 0.691287 0.86636
C  3.911584 -0.68177 0.113516
C  2.085108 -2.969796 -0.006945
C  -2.418498 0.305748 -1.551693
C  4.355581 1.72193 0.0689
C  4.822775 0.375623 0.149214
C  -3.950241 0.944424 0.720041
C  -1.941939 0.783349 2.225813
C  -3.801707 0.558722 -1.683475
C  -4.572728 0.881686 -0.542738
H  0.409172 3.213835 0.608599
H  0.5864 3.135828 -1.159366
H  -0.960283 2.685225 -0.404634
H  -1.85031 -2.024528 0.143209
H  -0.563373 -3.226571 0.518001
H  2.642395 3.016759 -0.100784
H  4.28384 -1.708026 0.177863
H  2.574424 -3.195899 0.960127
H  1.298847 -3.71846 -0.174403
H  2.840013 -3.125724 -0.799581
H  -1.8232 0.047507 -2.433481
H  5.071885 2.550461 0.095316
H  5.895929 0.174796 0.238707
H  -4.543694 1.180123 1.611824
H  -2.466839 1.476534 2.897689
H  -0.860481 0.970652 2.214297
H  -4.273743 0.499554 -2.670174
H  -5.645822 1.079103 -0.638134
