program: Gaussian 09
title: 000270779
version: EM64L-G09RevD.01
frameworkgroup: C1[X(C12H9N3O4S)]
method: RPBEPBE
basis: SDD
operation: Freq
keyword: #p
keyword: freq=noraman
keyword: PBEPBE/SDD
title: #p freq=noraman PBEPBE/SDD
converged: YES YES NO NO
title: Mulliken charges:
elementType: S O O O O N N N C C C C C C C C C C C C H H H H H H H H H
charge: 0.496987 -0.180976 -0.195484 -0.196694 -0.191868 -0.857186 0.010165 0.020217 -0.475759 0.525580 0.442686 -0.492680 -0.035333 -0.413578 0.564553 -0.421398 -0.374864 -0.190036 -0.206513 -0.260853 0.338100 0.303301 0.298245 0.337106 0.222866 0.244590 0.228299 0.227760 0.232767
chargesum: 0.00000
title: Mulliken charges with hydrogens summed into heavy atoms:
elementType: S O O O O N N N C C C C C C C C C C C C
charge: 0.496987 -0.180976 -0.195484 -0.196694 -0.191868 -0.520080 0.010165 0.020217 -0.475759 0.525580 0.442686 -0.154580 0.267968 -0.115333 0.564553 -0.198532 -0.130274 0.038263 0.021247 -0.028086
polarizability: 3.07236883e+02 1.18276579e+01 1.97418056e+02 1.84237365e+01 5.66070206e+00 1.23607231e+02
1716.lowfreq: -2.5001 -0.0024 -0.0018 -0.0013 1.8524 5.9143 19.6606 31.8485 32.1414
frequency: 19.6063 31.8440 32.1366 55.2209 82.4927 96.8275 138.0827 161.0836 169.3855 182.7150 212.8453 247.4477 283.4376 304.4545 326.4908 352.2232 387.3369 405.6889 442.1724 453.4669 493.1512 501.8680 508.0154 520.6371 565.5168 586.3624 611.0933 650.9257 655.2512 688.5279 692.5327 715.8485 736.4986 743.0443 756.3187 759.8464 825.0549 846.0633 866.5441 870.7200 890.5090 963.3879 969.0424 980.6725 985.3432 1008.7438 1021.3432 1024.4414 1067.6103 1086.9294 1119.6350 1141.7697 1171.7728 1185.4347 1196.4471 1210.4006 1232.9958 1248.5109 1299.0591 1356.1201 1359.5316 1364.8669 1396.4287 1401.6294 1422.9188 1439.6204 1460.1298 1480.3461 1575.4333 1594.1143 1597.4875 1612.7016 3116.3951 3132.3016 3143.4088 3154.0086 3163.9852 3171.1486 3185.1874 3187.1258 3549.1854
redmass: 7.1155 3.9424 7.6758 15.2000 8.1518 9.4162 8.0920 5.4789 10.0777 8.4890 6.8607 6.5361 7.4244 8.3968 11.1577 12.1845 9.3530 2.8737 3.4324 1.3739 10.2002 3.4308 3.8592 6.5268 6.0036 6.0319 6.3010 8.2646 7.9224 10.8282 1.9317 5.5469 5.4817 4.7863 11.4463 1.7624 1.2590 5.3120 2.7078 2.0546 1.4647 1.3661 1.4659 5.6982 1.3226 1.3511 5.7653 2.1544 1.6566 1.5496 9.3877 1.3122 1.0489 1.1183 9.8203 4.1792 1.8162 2.1050 1.6432 6.0788 1.6946 8.7866 7.8744 3.1913 7.8091 2.7092 2.0686 2.4082 9.1675 6.0009 6.9878 6.2262 1.0878 1.0859 1.0919 1.0950 1.0886 1.1013 1.0925 1.0956 1.0770
irintensity: 0.4143 0.3299 0.5026 0.0481 3.4214 0.0054 1.5315 2.5297 11.5938 0.9180 0.1695 4.1587 3.9990 0.7212 7.4303 2.9239 15.9275 0.2711 3.0618 92.3628 1.0168 7.4317 11.3579 2.4937 3.0928 4.5273 3.2418 13.9633 8.6841 16.7629 33.5973 9.1938 8.9740 14.4724 13.1376 84.3740 0.5509 61.8349 29.2875 19.9981 7.2846 0.1690 25.9850 0.3877 0.3917 0.5258 39.9036 9.5151 25.7958 12.9110 7.8307 8.6711 1.0405 5.9736 356.4174 179.8454 143.4962 68.5701 60.8510 164.1603 22.8076 30.6922 91.2118 11.5262 4.8737 70.6884 18.5675 130.1872 33.7704 14.5262 116.7856 119.3545 11.7472 3.2107 16.9260 28.4960 10.8011 17.4444 21.7102 2.7216 33.3324
temp: 298.150 k
press: 1.00000 atm
elementType: 16 8 8 8 8 7 7 7 6 6 6 6 6 6 6 6 6 6 6 6 1 1 1 1 1 1 1 1 1
symmnumber: 1
zpe: 518263.6 jmol-1
zpe.correction: 0.197396 hartree
zpe.thermalcorrener: 0.214719 hartree
zpe.thermalcorrenthalpy: 0.215663 hartree
zpe.thermalcorrgfe: 0.149504 hartree
zpe.sumelectzpe: -1324.288046 hartree
zpe.sumelectthermal: -1324.270723 hartree
zpe.sumelectthermalent: -1324.269779 hartree
zpe.sumelectthermalfe: -1324.335939 hartree
dipole: -5.4267 -1.3087 -2.2962
dipole: 6.0361
quadrupole: -137.7674 -143.7527 -111.3006
quadrupole: 9.7902 0.7897 -2.3271
quadrupole: -6.8272 -12.8125 19.6396 9.7902 0.7897 -2.3271
hfenergy: -1324.4854423 hartree
pointgroup: C01 [X(C12H9N3O4S1)]
dipole: -1.9226932 -0.8528544 -1.1025022 debye
polarizability: 295.1341902|25.8866996|202.5233001|39.5550069|3.3898082|130.6046794 unknown
InChI: InChI=1S/C12H9N3O4S/c16-14(17)10-6-7-12(11(8-10)15(18)19)20-13-9-4-2-1-3-5-9/h1-8,13H
charge 0 multiplicity 1
29 atoms
S  -1.024135 1.746252 -0.906099
O  2.734745 3.453835 0.759942
O  0.598515 3.543907 -0.046227
O  3.891509 -2.755422 0.657112
O  4.960987 -0.831237 1.26647
N  -2.018643 0.402184 -1.523234
N  1.67324 2.8930 0.300392
N  3.944854 -1.473143 0.798701
C  0.474595 0.794195 -0.38517
C  1.634624 1.431449 0.14341
C  2.753252 -0.688799 0.393853
C  2.779636 0.705545 0.531759
C  0.495373 -0.618821 -0.503598
C  1.618649 -1.363789 -0.119364
C  -3.044558 -0.240248 -0.779764
C  -3.993247 -1.036086 -1.48092
C  -3.127858 -0.136128 0.633448
C  -4.998196 -1.725206 -0.771293
C  -4.144803 -0.825937 1.328333
C  -5.083471 -1.625985 0.637372
H  3.655855 1.22538 0.928419
H  -0.391428 -1.114762 -0.907784
H  1.636465 -2.453475 -0.204046
H  -2.048142 0.324036 -2.54184
H  -3.942245 -1.113261 -2.574441
H  -2.412434 0.487038 1.180317
H  -5.720993 -2.336025 -1.323731
H  -4.201175 -0.73494 2.41884
H  -5.868169 -2.158358 1.184143
