program: Gaussian 09
title: 000270773
version: EM64L-G09RevD.01
frameworkgroup: C1[X(C9H11NO2)]
method: RPBEPBE
basis: SDD
operation: Freq
keyword: #p
keyword: freq=noraman
keyword: PBEPBE/SDD
title: #p freq=noraman PBEPBE/SDD
converged: YES YES NO NO
title: Mulliken charges:
elementType: O O N C C C C C C C C C H H H H H H H H H H H
charge: -0.291855 -0.441348 -0.138068 0.266611 0.152321 -0.345624 -0.350144 -0.204623 -0.222047 -0.220358 -0.233681 -0.681336 0.266297 0.263658 0.216727 0.241205 0.226579 0.225954 0.228107 0.210482 0.231679 0.225086 0.374378
chargesum: 0.00000
title: Mulliken charges with hydrogens summed into heavy atoms:
elementType: O O N C C C C C C C C C
charge: -0.291855 -0.066970 -0.138068 0.266611 0.152321 -0.079327 -0.086486 0.253309 0.004532 0.005596 -0.005574 -0.014089
polarizability: 1.64115073e+02 -1.19477256e+01 1.28916450e+02 1.20125853e+00 2.01201972e+00 5.40001269e+01
1716.lowfreq: -8.5884 0.0003 0.0006 0.0007 9.9154 13.4312 34.7404 61.9242 79.3892
frequency: 34.1195 61.9137 79.3646 115.9550 132.2436 214.0075 237.8622 261.7680 288.5180 328.7470 369.7293 382.0035 404.9017 446.7274 474.1033 616.2885 634.5820 656.0551 697.9139 763.2709 780.9489 804.2238 858.9824 860.6415 888.1581 942.0594 989.2155 990.4292 1001.6269 1005.5287 1025.9013 1075.5137 1083.9547 1110.0616 1130.1870 1172.2944 1184.2393 1240.2832 1251.3824 1313.8740 1325.3906 1361.3213 1385.7503 1395.8513 1434.5133 1459.5596 1470.8100 1483.4458 1486.2246 1552.7089 1592.1431 1613.3500 2992.2946 3021.3677 3086.7545 3090.7636 3116.5228 3126.0451 3138.2442 3155.7198 3170.8954 3178.7604 3573.9487
redmass: 3.6785 3.5653 1.9770 4.3621 5.2845 4.7915 1.3117 3.6273 4.4634 5.2493 5.6531 1.1877 2.7746 4.0156 3.6366 6.4181 5.4582 6.7883 1.8938 3.2536 2.0138 1.1021 6.3758 1.2509 6.8651 1.4221 3.9152 1.5814 1.3196 2.3484 2.3455 2.9724 1.8543 2.2209 1.4509 1.0530 1.1176 1.6188 1.2732 1.3212 1.6677 1.5142 8.4265 1.2789 2.2907 1.0413 1.0685 1.7504 1.2921 6.3389 6.6013 6.1486 1.0357 1.0614 1.1014 1.0982 1.1051 1.0851 1.0898 1.0954 1.0955 1.0969 1.0676
irintensity: 0.4354 6.7250 0.6817 1.7207 1.1831 0.3272 1.3429 0.7144 0.9389 1.9493 12.5086 136.8141 3.9769 4.4336 1.8209 0.5984 29.3858 22.9598 50.6227 20.9050 37.4259 3.9967 76.4851 0.1644 76.8889 6.3075 0.0928 0.1632 1.0860 14.0734 41.7943 144.6937 10.0899 5.9710 6.9801 0.0063 20.2245 204.9783 76.5021 0.0785 13.9327 2.2207 0.7562 24.4012 5.5678 12.2962 12.7742 20.1759 1.3384 68.6687 7.3194 2.3095 19.0959 21.3966 8.2374 24.7638 50.3945 0.0177 17.9117 29.1658 13.8215 7.4564 66.6298
temp: 298.150 k
press: 1.00000 atm
elementType: 8 8 7 6 6 6 6 6 6 6 6 6 1 1 1 1 1 1 1 1 1 1 1
symmnumber: 1
zpe: 479235.8 jmol-1
zpe.correction: 0.182531 hartree
zpe.thermalcorrener: 0.194460 hartree
zpe.thermalcorrenthalpy: 0.195405 hartree
zpe.thermalcorrgfe: 0.143662 hartree
zpe.sumelectzpe: -553.799529 hartree
zpe.sumelectthermal: -553.787600 hartree
zpe.sumelectthermalent: -553.786656 hartree
zpe.sumelectthermalfe: -553.838398 hartree
dipole: -1.1644 -0.0805 0.7159
dipole: 1.3692
quadrupole: -57.1342 -60.9442 -74.8161
quadrupole: -1.5031 -1.5369 -0.0642
quadrupole: 7.1639 3.3540 -10.5180 -1.5031 -1.5369 -0.0642
hfenergy: -553.9820603 hartree
pointgroup: C01 [X(C9H11N1O2)]
dipole: 0.491527 -0.027244 -0.2187379 debye
dipolederiv: -1.1615938 0.6929408 0.0131899 0.6084466 -0.9813077 -0.0774365 -0.0646146 0.06272 -0.2608705 -1.2744993 -0.6031023 -0.2960004 -0.0888904 -0.1098965 -0.0123919 -0.2669663 -0.1816095 -0.4526943 0.4712008 0.413167 0.2617828 0.0702529 -0.5040607 -0.0276882 0.2710014 0.1657913 -0.13171 0.0425056 0.1211462 0.0325043 0.1245527 -0.0541172 -0.0005552 -0.0007946 -0.0170036 0.0084043 0.8964699 -0.3281173 0.113322 -0.6077843 1.045968 0.0452436 0.1551284 -0.0513058 0.1219715 -0.0969387 0.0482173 0.026836 -0.0126191 0.0216197 0.0399705 -0.0057404 0.0471091 -0.121048 -0.0409893 -0.1015314 0.0002401 -0.0404385 -0.035229 0.0197548 0.0407765 0.0035106 -0.1308161 0.9030654 -0.4719838 -0.0793839 -0.2463628 0.4020867 0.0248231 -0.1086681 0.0227528 0.3643469 -0.0013697 -0.1186021 0.0051964 -0.1420511 0.0468418 0.0212292 0.0013295 0.0227704 -0.1515392 -0.0821357 0.0871502 0.03602 0.1258187 0.098571 0.080223 0.0409273 0.0724707 -0.1342436 0.0394886 -0.0014403 0.0424612 -0.0039504 -0.0426104 0.0237295 0.0374738 0.0289201 -0.1470101 -0.0193386 0.1084674 0.0166844 0.0837763 -0.1362965 -0.0341416 0.0416023 -0.0511782 0.0542968 0.1177489 -0.0592542 -0.0252112 -0.0337684 -0.0046832 -0.0467158 -0.022564 -0.0494473 0.1379551 0.0920558 0.0783841 0.004914 0.0900192 0.0068526 -0.0209317 0.0147196 -0.0160777 0.1485394 -0.0483057 0.0693198 0.0201002 -0.0343405 -0.0322025 0.1023821 0.0656232 0.0699008 -0.0706636 -0.0652263 0.0429614 -0.039234 -0.0509702 0.0467506 -0.0566019 -0.0701062 -0.0534862 -0.0407746 -0.0149641 0.1025042 -0.0091377 0.1214104 -0.0408159 -0.022417 -0.0066216 -0.0263505 0.149112 0.0451401 -0.0607134 -0.0348198 -0.0840074 -0.0854162 -0.0707057 -0.0417005 -0.0670228 0.1337574 -0.1288499 -0.0219114 -0.0613487 -0.0220131 0.0919203 -0.0202929 -0.0615742 -0.0190555 0.1451002 -0.1642438 0.0644265 0.0390153 0.0392976 0.0617801 -0.00853 0.0372879 -0.0148965 0.1095913 0.1091092 -0.0769108 0.056249 -0.0188588 0.0108989 0.0805192 0.0443307 0.1085146 -0.0543055 0.0660409 -0.0772943 -0.1163823 -0.0128399 0.0518672 -0.0467318 -0.0919806 -0.0623352 -0.063915 0.3156298 0.0921764 -0.0069975 0.1353204 0.1414791 0.0072651 -0.0088694 0.0053085 0.3865156 unknown
polarizability: 163.0292841|3.4619891|123.0837479|20.1251184|15.6916356|60.9186184 unknown
InChI: InChI=1S/C9H11NO2/c1-2-12-9(10-11)8-6-4-3-5-7-8/h3-7,11H,2H2,1H3
charge 0 multiplicity 1
23 atoms
O  1.348886 -0.891235 0.56055
O  2.524405 1.595657 1.139325
N  1.108438 1.552391 0.736144
C  -0.776148 0.164488 0.190203
C  0.671168 0.322779 0.510171
C  -1.663942 1.272765 0.273654
C  -1.283387 -1.103545 -0.198003
C  2.823854 -1.000479 0.320913
C  -3.028872 1.112428 -0.036045
C  -2.6537 -1.25868 -0.501842
C  -3.531417 -0.153601 -0.424889
C  3.092673 -2.479829 0.061996
H  -1.268301 2.245207 0.580647
H  -0.598167 -1.953654 -0.252524
H  3.089584 -0.370734 -0.546937
H  3.356316 -0.623527 1.207797
H  -3.704305 1.972802 0.029437
H  -3.034871 -2.242257 -0.79851
H  -4.594396 -0.275509 -0.661584
H  4.175555 -2.639032 -0.095325
H  2.774563 -3.09052 0.924562
H  2.553747 -2.831684 -0.834544
H  2.662619 2.569466 1.256609
