program: Gaussian 09
title: 000270772
version: EM64L-G09RevD.01
frameworkgroup: C1[X(C23H17NO4)]
method: RPBEPBE
basis: SDD
operation: Freq
keyword: #p
keyword: freq=noraman
keyword: PBEPBE/SDD
title: #p freq=noraman PBEPBE/SDD
converged: NO YES NO NO
title: Mulliken charges:
elementType: O O O O N C C C C C C C C C C C C C C C C C C C C C C C H H H H H H H H H H H H H H H H H
charge: -0.195084 -0.197385 -0.240518 -0.257045 -0.223355 -0.571663 0.361207 0.174917 0.189618 0.113654 0.076136 0.163820 -0.371325 -0.356047 -0.354375 -0.004045 -0.367421 -0.211274 -0.212105 -0.245110 0.306295 -0.247574 -0.320165 -0.360961 -0.371004 -0.355387 0.322354 -0.537508 0.299253 0.256468 0.254116 0.268503 0.270200 0.264379 0.238394 0.238866 0.231249 0.232528 0.265935 0.273831 0.243680 0.254721 0.226495 0.248529 0.224202
chargesum: 0.00000
title: Mulliken charges with hydrogens summed into heavy atoms:
elementType: O O O O N C C C C C C C C C C C C C C C C C C C C C C C
charge: -0.195084 -0.197385 -0.240518 -0.257045 -0.223355 -0.015943 0.361207 0.174917 0.189618 0.113654 0.076136 0.163820 -0.117209 -0.087544 -0.084175 -0.004045 -0.103042 0.027120 0.026761 -0.013861 0.306295 -0.015046 -0.054231 -0.087130 -0.127324 -0.100666 0.322354 0.161718
polarizability: 3.64634055e+02 3.90064795e+01 2.65142634e+02 -5.56342039e+00 1.83787903e+01 2.00830021e+02
1716.lowfreq: -3.0796 -0.0007 -0.0005 0.0004 4.5201 7.3262 13.4831 22.6249 32.1341
frequency: 13.0350 22.5175 32.0914 42.0733 54.6379 60.5713 83.2840 105.2631 130.0448 132.2139 138.8450 146.6961 175.1513 196.1808 214.6621 234.6061 238.5953 257.7416 263.6821 292.3931 316.0602 334.2415 358.3289 369.7921 411.5430 415.1972 417.9435 456.0882 459.0196 468.8492 500.8127 522.2218 527.1283 564.7543 581.0951 600.7267 616.3319 630.6451 659.1696 672.2966 682.6311 688.1216 697.9191 716.3962 751.1609 756.0205 776.6369 786.4155 789.3911 794.7367 814.1304 822.4736 837.9883 854.4732 888.7549 906.8378 917.6216 942.4200 947.5721 963.4300 968.8011 974.3556 983.2217 985.8877 996.1599 1003.3365 1005.9650 1015.0826 1042.9097 1068.1956 1073.8812 1113.1276 1113.2464 1115.7836 1155.8325 1158.8559 1166.8609 1171.0706 1178.4918 1181.5424 1197.0374 1208.6340 1237.4441 1268.1869 1283.6503 1284.7546 1301.6085 1311.5640 1320.5947 1361.2547 1376.5763 1383.4685 1416.0968 1428.9209 1430.0537 1437.1670 1453.3156 1453.8383 1468.8203 1468.9404 1472.6193 1481.5383 1497.9844 1527.9225 1575.0126 1583.7722 1605.7099 1615.0148 1616.8008 1617.2822 1625.7212 1674.3359 2966.2397 3033.8552 3056.8300 3111.6779 3123.0160 3129.8118 3133.1875 3139.0251 3146.5424 3151.3373 3151.5985 3152.8145 3163.8917 3164.5398 3170.3456 3174.1431 3174.3235
redmass: 6.3790 7.2815 5.3843 5.8212 3.9980 4.9913 4.6412 6.7330 8.4803 4.7242 5.0756 4.4790 7.3823 4.1415 2.2090 4.7727 2.0076 4.3934 4.2789 5.0856 6.2453 7.4947 6.0087 3.2327 3.1420 3.1350 3.7383 4.8812 3.7848 4.2375 3.8789 5.7557 4.8418 5.0051 7.3955 5.9280 5.9615 6.7613 4.8161 5.2179 5.4280 4.5270 4.8895 3.0473 3.7213 2.8276 3.1830 5.2126 2.2267 1.7499 2.9427 1.5201 4.3053 1.7323 1.4764 1.3924 5.2750 2.6421 6.3564 1.4322 1.4112 1.4129 3.7042 1.7288 1.3304 2.5286 1.3456 2.0404 2.4378 2.5404 2.7957 1.2592 1.5361 1.9194 1.3282 2.1162 1.2424 2.0170 1.0703 1.3419 2.4731 2.6315 3.1198 1.6219 1.7931 2.2098 1.2842 1.7652 2.7545 2.2793 5.4975 3.5357 6.1204 3.6680 2.3191 1.1807 2.4730 2.6616 1.0523 1.1997 1.0833 2.1530 2.5318 9.1202 7.1951 7.2157 6.0063 7.7065 6.9230 7.7254 10.2390 11.9974 1.0327 1.0641 1.1042 1.0987 1.0867 1.0999 1.0885 1.0864 1.0939 1.0881 1.0875 1.0906 1.1007 1.0956 1.0957 1.0972 1.1003
irintensity: 0.1780 0.4300 1.0689 0.6247 1.8203 0.7155 0.3015 4.5748 0.5078 7.0043 0.0630 5.9619 0.9235 1.0573 0.7735 0.3969 0.3881 2.1833 11.3975 2.4545 10.8032 9.8556 1.4716 0.6130 2.2806 4.1850 4.3295 0.0558 4.0696 0.6235 28.4820 5.4426 5.7931 7.7847 16.3616 35.6516 17.7911 9.3186 0.0337 9.5421 11.3661 10.1724 16.9935 56.7332 24.1929 16.5681 16.4543 0.5933 19.8805 45.1304 16.8512 0.8473 4.5631 47.4223 14.0032 0.0131 74.7971 42.7626 7.1171 0.5337 9.8710 2.0463 40.0584 7.4109 0.4920 1.9839 0.0026 1.4674 6.0255 35.7817 0.6026 0.2140 11.5977 5.5939 17.3999 29.0806 7.2967 3.5028 1.2982 154.8249 4.6614 11.6253 185.6310 58.3771 107.2157 230.8509 6.0333 75.8541 197.8907 98.1613 9.4375 28.5651 14.3014 39.3626 3.1595 4.9817 12.0808 2.1545 16.0554 33.4947 42.0776 19.7415 32.9640 206.8843 33.8550 22.6422 12.9924 9.7844 409.7109 11.0984 245.1092 51.4302 64.5655 3.6450 42.4426 10.8887 2.6538 26.5031 4.0483 1.6854 24.2655 0.1682 5.7248 5.7952 25.7649 6.0914 11.4527 6.2738 21.8184
temp: 298.150 k
press: 1.00000 atm
elementType: 8 8 8 8 7 6 6 6 6 6 6 6 6 6 6 6 6 6 6 6 6 6 6 6 6 6 6 6 1 1 1 1 1 1 1 1 1 1 1 1 1 1 1 1 1
symmnumber: 1
zpe: 895124.3 jmol-1
zpe.correction: 0.340935 hartree
zpe.thermalcorrener: 0.364359 hartree
zpe.thermalcorrenthalpy: 0.365303 hartree
zpe.thermalcorrgfe: 0.285499 hartree
zpe.sumelectzpe: -1240.389304 hartree
zpe.sumelectthermal: -1240.365881 hartree
zpe.sumelectthermalent: -1240.364937 hartree
zpe.sumelectthermalfe: -1240.444741 hartree
dipole: -0.4669 4.5501 5.4850
dipole: 7.1419
quadrupole: -135.6368 -149.3552 -159.2559
quadrupole: -6.5078 5.0410 -1.2967
quadrupole: 12.4458 -1.2726 -11.1733 -6.5078 5.0410 -1.2967
hfenergy: -1240.7302393 hartree
pointgroup: C01 [X(C23H17N1O4)]
dipole: -1.7038378 0.497945 -2.1781232 debye
polarizability: 260.8064337|31.3846479|363.6651406|26.8225777|24.483299|206.1351365 unknown
InChI: InChI=1S/C23H17NO4/c1-28-17-12-10-15(11-13-17)21(25)18-7-3-2-6-16(18)14-24-22(26)19-8-4-5-9-20(19)23(24)27/h2-13H,14H2,1H3
charge 0 multiplicity 1
45 atoms
O  -1.322414 0.704653 0.212312
O  1.299747 4.237923 1.892821
O  1.704551 -1.655323 1.98433
O  -1.97881 -5.906728 -1.091729
N  0.236316 2.244019 1.143086
C  1.31881 1.288588 1.457102
C  1.987077 0.758339 0.188848
C  -1.791828 3.143336 0.433214
C  -1.005307 4.205644 0.942245
C  -1.00412 1.87225 0.548947
C  0.309459 3.645748 1.395304
C  1.949795 -0.61883 -0.180027
C  2.615356 1.685597 -0.677869
C  -3.082902 3.364316 -0.067632
C  -1.48245 5.524382 0.965873
C  1.400458 -1.67679 0.745728
C  2.536807 -1.025427 -1.409344
C  -3.576388 4.695378 -0.047602
C  -2.788367 5.75894 0.460937
C  3.215342 1.269643 -1.8856
C  0.536497 -2.758822 0.193532
C  3.174788 -0.094494 -2.254653
C  -0.238026 -2.583949 -0.982844
C  0.421709 -3.983185 0.915079
C  -1.095055 -3.602738 -1.44576
C  -0.413005 -5.00995 0.459016
C  -1.175371 -4.823419 -0.726869
C  -2.804483 -5.774471 -2.297095
H  0.910607 0.469687 2.066818
H  2.045435 1.846963 2.074276
H  2.639369 2.744866 -0.394417
H  -3.68244 2.535337 -0.456518
H  -0.865194 6.336731 1.362015
H  2.510894 -2.084845 -1.686064
H  -4.581038 4.906738 -0.429283
H  -3.196083 6.775478 0.463895
H  3.711206 2.002111 -2.532096
H  3.639247 -0.430038 -3.188248
H  -0.200377 -1.628932 -1.516032
H  1.001435 -4.098604 1.836636
H  -1.698076 -3.434524 -2.342608
H  -0.502647 -5.960242 0.993558
H  -3.535621 -4.950059 -2.192571
H  -3.335138 -6.733351 -2.385928
H  -2.178964 -5.608042 -3.195083
