program: Gaussian 09
title: 000270771
version: EM64L-G09RevD.01
frameworkgroup: C1[X(C7H8N2O2)]
method: RPBEPBE
basis: SDD
operation: Freq
keyword: #pfreq=noraman
keyword: PBEPBE/SDD
title: #p freq=noraman PBEPBE/SDD
converged: NO YES NO NO
title: Mulliken charges:
elementType: O O N N C C C C C C C H H H H H H H H
charge: -0.404210 -0.475699 -0.358318 -0.122842 0.374431 -0.360737 -0.393502 0.138044 -0.220529 -0.226733 -0.230599 0.258120 0.242055 0.229313 0.227789 0.230652 0.346501 0.366261 0.380003
chargesum: 0.00000
title: Mulliken charges with hydrogens summed into heavy atoms:
elementType: O O N N C C C C C C C
charge: -0.037949 -0.095695 -0.011817 -0.122842 0.374431 -0.102617 -0.151447 0.138044 0.008784 0.001055 0.000053
polarizability: 1.44571244e+02 -1.11638511e+01 1.04040080e+02 -3.38229587e+00 -1.08403830e+01 5.19918181e+01
1716.lowfreq: -6.7727 -5.0144 -0.0007 0.0003 0.0004 5.9562 61.6671 102.0757 137.6647
frequency: 61.6497 102.0753 137.6630 146.8474 226.4882 264.1345 277.5020 339.8861 357.8204 374.9445 407.8325 472.7016 513.1254 614.1682 642.8897 652.8736 702.7030 725.9154 776.7243 800.8978 857.1906 863.7944 934.8942 981.5618 986.9608 990.2013 999.0004 1023.5075 1080.7113 1112.8604 1173.2991 1185.4211 1228.8242 1305.9801 1318.1987 1366.2441 1382.2462 1429.9587 1437.7550 1492.2653 1548.9294 1593.3577 1615.2821 3124.8882 3133.7047 3145.9435 3158.3336 3170.2866 3462.5916 3525.5762 3605.2390
redmass: 4.4435 5.3667 5.4771 4.6782 4.8389 2.5521 3.5819 1.6273 6.7255 1.3276 2.8272 4.0937 4.0905 6.4533 6.2637 4.3279 1.8090 4.0711 1.9711 2.2767 1.3824 4.6698 1.4605 1.5474 2.8962 4.4440 1.3303 2.3951 1.5757 3.0935 1.0539 1.1169 1.2736 1.2907 1.2801 2.4925 8.2459 1.9119 1.5526 2.8397 4.1194 6.0893 6.1645 1.0851 1.0881 1.0932 1.0964 1.1004 1.0754 1.0685 1.0679
irintensity: 0.8150 1.2348 4.1682 3.5540 2.7680 57.4992 45.9137 109.1797 7.4437 133.2957 1.6518 3.7758 15.3062 0.2292 43.0587 41.2415 47.9759 55.3389 70.9620 125.8655 16.2767 113.6617 3.2914 4.2389 38.6605 0.5986 0.5992 2.8367 8.9228 11.8469 0.0113 0.8039 95.7992 60.5542 44.5622 22.8912 0.3686 5.7800 3.7275 14.7814 29.5968 2.7557 0.3810 2.4206 2.8910 28.0623 24.9413 12.9383 29.0779 14.3788 79.7037
temp: 298.150 k
press: 1.00000 atm
elementType: 8 8 7 7 6 6 6 6 6 6 6 1 1 1 1 1 1 1 1
symmnumber: 1
zpe: 375829.9 jmol-1
zpe.correction: 0.143146 hartree
zpe.thermalcorrener: 0.153421 hartree
zpe.thermalcorrenthalpy: 0.154365 hartree
zpe.thermalcorrgfe: 0.107352 hartree
zpe.sumelectzpe: -530.580543 hartree
zpe.sumelectthermal: -530.570269 hartree
zpe.sumelectthermalent: -530.569324 hartree
zpe.sumelectthermalfe: -530.616337 hartree
dipole: -0.5357 0.7492 -0.5313
dipole: 1.0632
quadrupole: -52.6487 -53.7580 -69.0477
quadrupole: -3.5270 -1.5648 -5.0160
quadrupole: 5.8361 4.7268 -10.5629 -3.5270 -1.5648 -5.0160
hfenergy: -530.7236891 hartree
pointgroup: C01 [X(C7H8N2O2)]
dipole: -0.2079055 -0.2969608 0.2087275 debye
dipolederiv: -0.4626697 0.162567 -0.0719593 0.1675179 -0.4111747 -0.1559586 -0.0424303 -0.4618713 -0.1758893 -1.5008733 -0.4547856 -0.0851383 0.1158453 -0.0227282 0.0476254 0.0644548 0.0718674 -0.4116922 -0.2265197 0.2526312 0.0712672 0.1203203 -0.4915985 0.1333682 -0.0065597 0.5638045 -0.0758645 0.7070078 0.3705599 0.0793398 -0.1021698 -0.51388 -0.041678 -0.132377 -0.1340929 -0.1994191 0.0706388 0.0556477 -0.0103088 0.0240924 -0.0420567 -0.0096158 0.1130059 0.0658371 0.0300534 -0.0649995 0.0669738 -0.0435744 0.0249704 -0.0065792 -0.0762736 -0.0174427 -0.0514897 -0.0949206 -0.0388963 -0.0786419 0.0410981 -0.0326497 -0.0361814 -0.0733327 -0.0122991 -0.0863621 -0.0897596 0.6185433 -0.2780975 -0.068794 -0.1992709 0.7289014 0.058413 -0.1042572 -0.008115 0.0022135 -0.0150587 -0.0932053 0.0581848 -0.1019231 0.0389267 -0.1003607 0.0604628 -0.094861 -0.09723 -0.045115 0.094236 -0.043552 0.1217164 0.0309094 -0.0932957 -0.0620656 -0.0901987 -0.1081736 0.0663745 -0.0026281 0.0061048 -0.017349 -0.0674997 -0.0449387 0.0157968 -0.0465588 -0.1329088 0.0628694 -0.072682 0.0417185 -0.0461996 0.0343305 0.0719536 0.0394277 0.0537161 0.1185813 0.0446078 0.0938576 -0.0516121 0.080146 -0.0138908 0.0804151 -0.0504115 0.0699952 0.0981779 0.0193352 0.0742628 -0.0417614 0.0916696 -0.0183346 0.0941356 -0.049196 0.0941114 0.1061862 0.0162886 -0.0776254 0.0373053 -0.0944102 -0.0238343 0.0942274 0.0457787 0.0931379 0.110257 -0.1344129 -0.0028243 -0.0074173 -0.0041458 0.1048851 0.0300826 -0.0096285 0.0249212 0.1469882 0.1789034 -0.0172198 0.018355 -0.077165 0.2435499 -0.0777565 0.0870123 -0.1500636 0.2379959 0.3389031 -0.1460715 0.0626326 -0.1560717 0.3118742 0.0957947 0.0353052 0.1131376 0.1368652 0.365073 0.0530454 0.0081116 0.0850764 0.1543807 -0.0328053 0.0254233 -0.0269151 0.3985389 unknown
polarizability: 144.3281334|11.5917547|104.2810553|3.5963806|-10.7790879|51.9939527 unknown
InChI: InChI=1S/C7H8N2O2/c10-8-7(9-11)6-4-2-1-3-5-6/h1-5,8,10-11H
charge 0 multiplicity 1
19 atoms
O  1.582575 -2.02903 -0.976144
O  3.356184 1.09195 0.26514
N  2.001728 -1.092394 0.085659
N  1.883994 1.300352 0.290036
C  -0.195733 0.100724 0.066266
C  -0.904868 1.186874 -0.50901
C  -0.919964 -0.99137 0.613863
C  1.286326 0.121455 0.114278
C  -2.315093 1.1774 -0.539408
C  -2.330119 -0.998724 0.579526
C  -3.032889 0.083333 -0.000983
H  -0.340137 2.024117 -0.930952
H  -0.378193 -1.80645 1.107105
H  -2.854768 2.01878 -0.987814
H  -2.881747 -1.84175 1.010338
H  -4.128095 0.074873 -0.030621
H  3.019941 -0.959043 0.009114
H  1.166741 -2.783967 -0.480993
H  3.697516 2.012471 0.383001
