program: Gaussian 09
title: 000270769
version: EM64L-G09RevD.01
frameworkgroup: C1[X(C15H24N2O)]
method: RPBEPBE
basis: SDD
operation: Freq
keyword: #p
keyword: freq=noraman
keyword: PBEPBE/SDD
title: #p freq=noraman PBEPBE/SDD
converged: YES YES NO NO
title: Mulliken charges:
elementType: O N N C C C C C C C C C C C C C C C H H H H H H H H H H H H H H H H H H H H H H H H
charge: -0.301111 -0.502155 -0.473749 0.224429 -0.388591 0.497356 0.323568 -0.787579 0.321136 -0.742141 -0.755002 -0.690245 -0.697228 -0.407006 -0.380683 -0.245868 -0.245598 -0.247183 0.180251 0.266188 0.279566 0.240788 0.212807 0.234452 0.281832 0.221251 0.202923 0.234815 0.210823 0.228348 0.219886 0.275712 0.198640 0.199768 0.203662 0.201023 0.272789 0.230677 0.238089 0.219570 0.219302 0.224488
chargesum: 0.00000
title: Mulliken charges with hydrogens summed into heavy atoms:
elementType: O N N C C C C C C C C C C C C C C C
charge: -0.301111 -0.222588 -0.191917 0.224429 0.057848 0.497356 0.323568 -0.099533 0.321136 -0.083153 -0.095945 -0.016126 -0.019754 -0.176328 -0.142594 -0.026297 -0.026296 -0.022696
polarizability: 1.96792704e+02 9.28244600e+00 1.82841401e+02 1.66583440e+01 -3.04669179e+00 1.48866848e+02
1716.lowfreq: -16.0913 -2.9974 -0.0006 -0.0006 -0.0005 3.7745 21.3631 26.4717 34.4613
frequency: 21.0897 26.2516 34.1787 72.2149 82.0748 100.1667 118.9182 139.8862 154.8757 189.2070 210.3490 225.5396 233.4881 243.5181 249.6229 260.9895 266.8127 292.5731 297.1367 315.2114 326.2704 335.9539 351.8160 390.7296 403.8528 409.5048 438.1928 448.0178 459.3406 508.7491 557.5785 606.0116 617.4491 697.6696 702.9878 718.6697 744.6012 766.1863 771.7192 800.9446 848.8659 862.4145 907.8571 910.7830 916.9376 923.0737 926.7175 946.7094 975.1460 981.9860 989.7223 992.8215 1010.0273 1027.8739 1031.6565 1035.3556 1054.0617 1073.0332 1082.3148 1093.1394 1157.6170 1170.8305 1188.9266 1193.6464 1204.5473 1221.6028 1234.2381 1243.9098 1270.8823 1298.7854 1318.5162 1336.2269 1367.9839 1371.3717 1379.0792 1382.4024 1390.2106 1396.0722 1432.7704 1436.1557 1446.7320 1459.6209 1464.3619 1466.8646 1470.9215 1472.5919 1474.5153 1481.8446 1483.0251 1483.8065 1487.3044 1488.9194 1501.9156 1591.3025 1612.6450 1625.7103 2969.2193 2977.3223 2978.6822 2980.3036 2985.2270 2993.6451 3056.9464 3060.0247 3070.3495 3072.4840 3075.3314 3078.6067 3084.1145 3090.4943 3097.1889 3102.0576 3107.6162 3117.8335 3126.5820 3140.8854 3153.3225 3165.6815 3527.2237 3537.3051
redmass: 3.6818 3.3361 3.6705 3.7073 3.6751 2.5367 2.9195 2.8406 2.4737 1.0474 1.5770 2.5006 1.5013 1.1739 1.2689 1.0612 1.3805 3.0736 3.0299 2.8803 2.9569 3.0761 3.1436 3.0608 2.8158 2.6582 2.8318 3.1102 1.2529 3.0440 2.9671 3.8983 6.3934 3.7996 1.7979 7.2667 4.1615 2.2053 2.7295 1.3567 1.2660 2.4746 1.9203 1.7650 1.4852 1.6552 2.8908 1.2081 1.3846 1.8544 2.8430 1.7657 1.6683 2.2480 1.3861 1.4721 2.0301 2.6319 1.6452 2.2174 2.1923 1.0549 1.4417 1.6639 2.2696 2.9601 3.0318 3.1510 2.5814 1.3313 1.3376 1.4246 1.2138 1.2222 5.5606 1.2755 1.2269 1.2261 1.9088 1.5821 1.0474 1.1130 1.0581 1.1906 1.0711 1.1569 1.1569 1.2808 1.2774 1.1658 1.1515 1.3409 1.0619 6.1116 6.1406 4.9493 1.0365 1.0364 1.0356 1.0361 1.0363 1.0630 1.0978 1.0998 1.0990 1.0999 1.0976 1.0995 1.1011 1.0979 1.0987 1.1003 1.0995 1.0841 1.0877 1.0929 1.0958 1.0983 1.0774 1.0769
irintensity: 1.4660 0.4523 0.3431 2.4419 3.9207 4.8703 6.1198 1.9877 1.0405 0.2465 1.9788 8.3451 0.9061 3.9216 7.3588 0.4083 1.0999 1.6770 4.6848 6.5517 2.2568 1.7342 3.0283 1.3038 0.0455 1.2139 2.0150 13.0255 153.2279 5.1662 15.5752 3.7445 0.0719 5.8528 49.5063 15.3675 4.2486 25.9952 21.2543 12.9723 0.6061 2.0937 0.4512 1.0126 3.2293 3.8268 1.5658 0.6664 0.2421 0.8013 0.1603 0.3913 12.2149 14.1331 0.3890 0.9190 2.7152 2.5865 12.2234 9.3381 58.4484 0.1184 11.7891 15.9339 57.0470 130.5137 29.7532 24.6837 133.5309 2.6300 2.6231 14.1957 33.9924 38.9315 5.8546 27.0452 31.7904 47.9200 34.2348 33.2818 0.2127 11.2859 8.9539 187.1568 12.8827 43.6909 55.1702 37.8425 23.5937 6.4351 25.5029 228.3189 12.4613 3.0636 6.1039 112.1555 27.5139 11.0181 37.2164 58.9345 32.9671 30.4560 10.5156 24.9805 42.4359 41.0409 26.0362 30.6172 41.3731 59.2158 24.2531 3.2989 17.5037 1.7957 4.1801 32.2570 43.5912 13.7699 11.3199 10.3052
temp: 298.150 k
press: 1.00000 atm
elementType: 8 7 7 6 6 6 6 6 6 6 6 6 6 6 6 6 6 6 1 1 1 1 1 1 1 1 1 1 1 1 1 1 1 1 1 1 1 1 1 1 1 1
symmnumber: 1
zpe: 949459.0 jmol-1
zpe.correction: 0.361630 hartree
zpe.thermalcorrener: 0.382107 hartree
zpe.thermalcorrenthalpy: 0.383051 hartree
zpe.thermalcorrgfe: 0.312348 hartree
zpe.sumelectzpe: -769.352193 hartree
zpe.sumelectthermal: -769.331716 hartree
zpe.sumelectthermalent: -769.330772 hartree
zpe.sumelectthermalfe: -769.401475 hartree
dipole: 1.2278 1.3040 3.5300
dipole: 3.9584
quadrupole: -101.9373 -106.0071 -108.1942
quadrupole: -1.4647 7.2729 -0.0282
quadrupole: 3.4422 -0.6276 -2.8147 -1.4647 7.2729 -0.0282
hfenergy: -769.7138233 hartree
pointgroup: C01 [X(C15H24N2O1)]
dipole: 0.5170071 0.5392237 1.3665059 debye
polarizability: 197.7605706|9.2882733|182.1059182|15.5989348|-4.6025832|148.6344636 unknown
InChI: InChI=1S/C15H24N2O/c1-6-15(5,12-10-8-7-9-11-12)17-13(18)16-14(2,3)4/h7-11,16-17H,6H2,1-5H3
charge 0 multiplicity 1
42 atoms
O  0.899763 -0.076901 -1.175129
N  0.285263 0.958744 0.840528
N  2.427981 0.036184 0.610291
C  -1.098654 1.315969 0.424486
C  -1.080021 2.25875 -0.824731
C  -1.928571 0.029989 0.167934
C  3.568553 -0.65757 -0.063744
C  -1.734243 2.045273 1.64485
C  1.18972 0.281011 0.010321
C  -0.143225 3.477643 -0.698588
C  4.728385 -0.679273 0.961966
C  3.167108 -2.108947 -0.442871
C  3.995565 0.132869 -1.327699
C  -2.979867 -0.01085 -0.781732
C  -1.704399 -1.121144 0.966204
C  -3.776406 -1.168996 -0.934116
C  -2.495928 -2.279204 0.817414
C  -3.540672 -2.309501 -0.135319
H  -2.111275 2.618578 -1.005631
H  -0.774416 1.654032 -1.696391
H  0.635847 1.409999 1.686901
H  -2.774043 2.329396 1.411972
H  -1.175246 2.964741 1.902805
H  -1.75631 1.380949 2.52771
H  2.529204 0.205245 1.612908
H  -0.180143 4.078779 -1.62537
H  -0.424964 4.144744 0.137739
H  0.904617 3.160603 -0.550755
H  4.442885 -1.231503 1.87862
H  5.605739 -1.187059 0.525904
H  5.032326 0.346706 1.243224
H  2.303011 -2.09269 -1.126711
H  2.89405 -2.685976 0.460052
H  4.010427 -2.620469 -0.942632
H  4.298395 1.161215 -1.058302
H  4.850921 -0.368504 -1.816809
H  3.157831 0.184354 -2.041665
H  -3.179373 0.852601 -1.423362
H  -0.885562 -1.110421 1.694534
H  -4.578234 -1.179769 -1.6816
H  -2.296289 -3.159133 1.440125
H  -4.15595 -3.208262 -0.25623
