program: Gaussian 09
title: 000270764
version: EM64L-G09RevD.01
frameworkgroup: C1[X(C28H25NO4)]
method: RPBEPBE
basis: SDD
operation: Freq
keyword: #p
keyword: freq=noraman
keyword: PBEPBE/SDD
title: #p freq=noraman PBEPBE/SDD
converged: YES YES NO NO
title: Mulliken charges:
elementType: O O O O N C C C C C C C C C C C C C C C C C C C C C C C C C C C C H H H H H H H H H H H H H H H H H H H H H H H H H
charge: -0.279516 -0.260646 -0.249186 -0.198519 -0.350038 -0.030674 -0.117821 0.238604 0.238449 0.158918 0.228315 0.334722 0.353910 -0.364738 -0.374285 0.113497 0.083847 -0.426688 -0.427844 -0.344783 -0.390843 -0.250905 -0.246713 -0.239274 -0.233331 -0.277962 -0.260304 -0.244206 -0.242778 -0.251841 -0.262283 -0.665446 -0.654482 0.254949 0.236639 0.256729 0.281222 0.260977 0.224944 0.248789 0.225723 0.226689 0.226596 0.227139 0.226040 0.228023 0.228300 0.229581 0.223590 0.238749 0.238560 0.218008 0.217858 0.224599 0.251602 0.208081 0.269700 0.221756
chargesum: 0.00000
title: Mulliken charges with hydrogens summed into heavy atoms:
elementType: O O O O N C C C C C C C C C C C C C C C C C C C C C C C C C C C C
charge: -0.279516 -0.260646 -0.249186 -0.198519 -0.095089 -0.030674 -0.117821 0.238604 0.238449 0.158918 0.228315 0.334722 0.353910 -0.128099 -0.117556 0.113497 0.083847 -0.145465 -0.166868 -0.119840 -0.142054 -0.025181 -0.020024 -0.012679 -0.006192 -0.051922 -0.032281 -0.015906 -0.013197 0.210498 0.194285 0.028614 0.045055
polarizability: 3.97157273e+02 4.36272154e+00 2.66694084e+02 -4.24908375e+00 2.37093884e+01 2.83356525e+02
1716.lowfreq: -6.8452 -2.5037 -0.0007 -0.0004 0.0007 5.5827 15.3892 25.4614 30.8039
frequency: 14.7992 25.4372 30.6832 35.0145 43.0143 43.5751 54.7070 60.7634 69.4219 80.0901 82.3955 92.9205 100.0350 110.8083 122.3362 139.7434 152.2037 190.8710 203.3014 208.6352 222.4040 229.9434 236.5049 243.9554 277.8830 286.4405 296.4198 316.4639 328.7731 358.2574 367.1775 405.3613 409.5911 412.1736 421.0853 441.2128 444.8002 484.1772 503.0334 524.0438 550.9237 562.5612 595.1288 615.0194 616.8186 623.5303 646.9974 659.7989 668.7839 674.2513 705.1474 712.5928 713.6423 722.9594 723.4408 741.9983 750.2142 763.7165 764.1706 773.6251 790.5325 811.1926 820.9563 829.0299 836.5333 860.1580 861.6265 875.8204 884.4781 889.2410 930.9562 935.2055 940.1508 940.9739 946.9136 981.8517 984.2036 984.7531 989.6520 992.5467 994.0678 996.1043 998.6532 1001.7509 1010.3366 1021.7617 1025.0118 1030.8177 1037.7425 1068.5420 1072.6304 1085.1921 1085.4137 1095.3978 1099.0949 1118.2188 1128.3187 1136.6307 1155.9259 1155.9613 1172.1124 1173.7340 1176.3538 1187.1405 1191.1073 1193.2854 1253.8668 1272.1323 1275.0063 1276.1155 1292.9685 1318.8698 1321.8458 1326.1346 1343.7764 1350.8170 1355.1323 1377.4639 1380.2439 1389.1486 1397.5991 1399.3478 1432.3931 1435.0483 1439.6049 1442.2223 1456.7496 1458.9982 1461.6540 1462.1110 1480.6919 1484.5505 1487.1090 1491.1501 1587.5713 1588.7624 1590.9516 1598.6814 1603.9700 1607.8635 1617.7477 1620.3008 1657.5801 2992.1502 2994.4331 3029.5834 3030.0183 3087.3880 3089.4577 3092.3823 3096.8866 3117.8313 3121.0111 3121.4921 3122.5506 3128.9735 3130.2657 3133.7152 3141.9076 3145.9063 3151.1925 3154.0872 3160.4079 3163.1133 3166.6735 3171.2359 3178.6116 3334.6011
redmass: 4.1905 4.5705 4.1976 4.4377 3.5968 4.2721 3.1336 4.2510 5.1461 4.2849 4.6017 5.4845 4.6532 3.6786 3.9730 5.2815 3.8268 3.2931 1.4780 1.3765 4.4627 5.0773 5.4223 5.2571 3.6912 3.6684 3.6795 4.3242 4.5335 5.4278 5.7503 3.5380 2.9031 3.0129 3.4922 4.8579 4.1908 4.5753 3.4371 3.9660 5.7214 6.0970 5.4607 6.3695 6.4233 6.4825 4.2973 6.5198 6.0725 6.0148 4.4721 1.8928 1.9217 3.8057 5.9665 2.2843 2.4154 1.7612 2.6556 2.9443 2.6194 1.4804 1.4400 2.7314 2.8635 1.2598 1.2751 1.6618 3.1523 4.5467 1.8340 1.9895 2.3395 1.4596 4.2001 1.3903 1.4191 1.3767 4.2767 4.5432 4.6237 3.1442 1.4317 1.3836 3.3168 3.6496 2.5306 2.3351 2.1829 4.2276 5.0361 1.6422 1.6289 2.1722 2.2207 2.3889 2.4625 1.6569 1.6864 1.6626 1.0526 1.0526 1.1107 4.9985 1.1201 1.1763 3.2190 2.1515 1.1256 1.1273 2.2574 1.6738 1.4219 2.2078 1.4753 1.2955 1.3720 7.2445 6.6970 1.2336 1.2236 6.3544 2.2905 2.3633 2.3139 2.4075 1.1023 1.0741 1.0508 1.0562 1.0566 1.0528 2.3812 2.4855 6.3306 8.1772 6.6751 7.0534 7.1441 9.9279 6.1483 6.1180 11.6140 1.0360 1.0366 1.0589 1.0590 1.0979 1.0983 1.1032 1.1037 1.1062 1.0862 1.1045 1.0850 1.0856 1.0875 1.0894 1.0927 1.0909 1.0940 1.0954 1.0952 1.0974 1.1007 1.0979 1.0950 1.0736
irintensity: 0.3733 0.4466 0.9448 0.2488 0.4617 0.2841 0.7687 0.4612 0.6423 0.4029 0.0952 1.0175 0.7070 0.2033 0.2424 0.4496 0.6746 0.7852 4.4000 2.3655 1.5253 0.7952 0.1637 0.5792 2.2470 0.9040 2.3516 9.4821 17.2129 6.3939 0.0637 0.5936 0.1074 0.3953 7.1328 0.8173 0.5136 0.2095 10.5430 0.7112 14.4829 0.5243 4.2248 9.7522 0.1667 15.9399 58.1920 5.9985 3.4542 2.6003 6.7682 42.1663 59.0113 5.4746 21.2991 57.3577 36.2019 22.8522 20.6965 3.6608 24.7775 5.1128 4.6624 7.8708 23.4411 0.3424 1.4672 8.1915 36.5449 22.8778 10.7900 1.4069 14.8526 1.7913 20.8141 0.3462 0.6190 0.1271 0.4110 4.9446 27.2573 15.0723 0.7731 3.8504 34.2063 90.0754 11.1577 22.8200 36.5716 46.5829 146.5862 2.4742 6.4952 10.4323 3.5853 54.4020 27.4906 4.1292 25.5323 19.2163 0.3172 0.2136 2.9535 208.6470 8.8959 10.9977 51.0714 146.0634 3.1987 11.8855 80.5231 4.3257 2.0696 22.4616 84.4320 2.1329 19.8437 0.1786 0.4676 25.1175 23.9788 2.1211 1.8880 8.5908 15.7173 24.6431 25.0938 21.9767 8.0515 12.7452 32.2016 13.2297 21.2414 6.5554 13.6064 106.8607 37.1443 27.8676 10.9173 114.5657 4.4411 2.8894 102.4456 21.8117 20.7244 39.9893 21.0746 35.7112 32.3492 3.5690 5.4494 25.9167 7.8871 22.3203 0.6926 0.2386 3.8908 14.3853 29.0540 13.4194 31.0991 20.7271 34.1414 18.0296 24.2624 9.9722 15.0226 4.9221
temp: 298.150 k
press: 1.00000 atm
elementType: 8 8 8 8 7 6 6 6 6 6 6 6 6 6 6 6 6 6 6 6 6 6 6 6 6 6 6 6 6 6 6 6 6 1 1 1 1 1 1 1 1 1 1 1 1 1 1 1 1 1 1 1 1 1 1 1 1 1
symmnumber: 1
zpe: 1199531.0 jmol-1
zpe.correction: 0.456877 hartree
zpe.thermalcorrener: 0.486549 hartree
zpe.thermalcorrenthalpy: 0.487494 hartree
zpe.thermalcorrgfe: 0.393572 hartree
zpe.sumelectzpe: -1435.264075 hartree
zpe.sumelectthermal: -1435.234403 hartree
zpe.sumelectthermalent: -1435.233459 hartree
zpe.sumelectthermalfe: -1435.327380 hartree
dipole: -1.1891 -0.0391 3.4825
dipole: 3.6801
quadrupole: -160.7372 -179.7032 -190.4151
quadrupole: -3.1222 3.9524 11.5448
quadrupole: 16.2146 -2.7514 -13.4633 -3.1222 3.9524 11.5448
hfenergy: -1435.7209522 hartree
pointgroup: C01 [X(C28H25N1O4)]
dipole: -0.4366092 -0.096642 -1.3770757 debye
polarizability: 396.6737532|7.6211161|269.450071|4.1477225|24.867405|281.084057 unknown
InChI: InChI=1S/C28H25NO4/c1-3-32-25(30)23-24(26(31)33-4-2)28(20-15-9-6-10-16-20)22-18-12-11-17-21(22)27(23,29-28)19-13-7-5-8-14-19/h5-18,29H,3-4H2,1-2H3
charge 0 multiplicity 1
58 atoms
O  -2.501065 -2.002334 0.117761
O  2.181097 -2.434064 -0.298932
O  -0.686395 -2.98194 1.214487
O  2.391502 -1.689501 1.912239
N  -0.006622 1.54233 0.568547
C  -1.084525 0.668402 -0.084848
C  1.18766 0.852713 -0.070624
C  -0.658142 0.796763 -1.592033
C  0.763774 0.896974 -1.580524
C  -0.51013 -0.71957 0.36767
C  0.848047 -0.594573 0.391034
C  -2.48716 1.069379 0.341988
C  2.547838 1.394755 0.303862
C  -1.36455 0.868289 -2.79872
C  1.493807 1.063718 -2.76153
C  -1.204466 -1.994547 0.628841
C  1.862387 -1.614998 0.782526
C  -2.650644 1.882469 1.492912
C  2.674429 2.442435 1.247109
C  -3.643505 0.663962 -0.372135
C  3.719489 0.844939 -0.277888
C  -0.629063 1.042509 -4.006254
C  0.777684 1.138237 -3.989791
C  -3.935754 2.296632 1.908971
C  3.948385 2.949448 1.586922
C  -4.926547 1.080333 0.040493
C  4.991866 1.347767 0.066033
C  -5.08025 1.904001 1.179726
C  5.111386 2.407706 0.994345
C  -3.285029 -3.260347 0.318823
C  3.089532 -3.592926 -0.004628
C  -3.004392 -4.260754 -0.806168
C  2.257578 -4.800991 0.432057
H  -0.089454 2.510441 0.199959
H  -2.456082 0.823073 -2.83102
H  2.58325 1.163076 -2.749696
H  -1.762196 2.170341 2.063395
H  1.776084 2.834699 1.734166
H  -3.549251 -0.017991 -1.220968
H  3.640061 0.007761 -0.981994
H  -1.16728 1.112344 -4.958236
H  1.325043 1.281169 -4.928127
H  -4.041231 2.922295 2.802478
H  4.033026 3.7587 2.320778
H  -5.808209 0.756495 -0.524433
H  5.889118 0.909852 -0.385528
H  -6.07777 2.227012 1.498424
H  6.09963 2.79855 1.26105
H  -4.330804 -2.912963 0.317775
H  -3.022814 -3.679832 1.305677
H  3.805905 -3.28621 0.77746
H  3.612388 -3.76334 -0.959504
H  -3.655746 -5.146548 -0.687064
H  -3.208037 -3.8120 -1.793845
H  -1.954741 -4.597433 -0.77636
H  2.925335 -5.66072 0.62814
H  1.692862 -4.573184 1.35081
H  1.537893 -5.087304 -0.353706
