program: Gaussian 09
title: 000270760
version: EM64L-G09RevD.01
frameworkgroup: C1[X(C10H21NO2)]
method: RPBEPBE
basis: SDD
operation: Freq
keyword: #p
keyword: freq=noraman
keyword: PBEPBE/SDD
title: #p freq=noraman PBEPBE/SDD
converged: NO YES NO NO
title: Mulliken charges:
elementType: O O N C C C C C C C C C C H H H H H H H H H H H H H H H H H H H H H
charge: -0.316815 -0.298996 -0.448081 0.398931 -0.382398 -0.381146 -0.826838 -0.384698 -0.730828 -0.699282 0.269350 -0.253564 -0.665028 0.186815 0.236505 0.193054 0.245340 0.227107 0.228322 0.229459 0.199528 0.214854 0.323550 0.229657 0.218806 0.211453 0.213796 0.207155 0.219149 0.233893 0.217166 0.212329 0.221994 0.249458
chargesum: 0.00000
title: Mulliken charges with hydrogens summed into heavy atoms:
elementType: O O N C C C C C C C C C C
charge: -0.316815 -0.298996 -0.124531 0.398931 0.040923 0.057248 -0.141950 0.029685 -0.070912 -0.059182 0.269350 0.197496 0.018753
polarizability: 1.40217763e+02 4.02544311e+00 1.20851076e+02 7.61639160e-01 8.86624006e-01 1.07151105e+02
1716.lowfreq: -19.1180 -9.2817 0.0007 0.0008 0.0009 8.2072 36.1772 40.5443 48.9629
frequency: 35.9018 40.3694 48.4811 71.6396 80.4553 91.1075 124.7879 140.6181 144.5810 197.6472 212.6493 225.8638 247.6714 278.0442 289.9091 306.2496 316.2486 337.0337 351.1614 404.0480 411.6740 498.1432 545.0137 577.6540 652.5913 704.6021 742.2276 755.4865 780.4101 801.2204 834.6819 866.6091 876.1299 899.2740 932.3874 971.0041 999.1354 1010.9449 1049.7886 1052.5733 1054.3052 1087.7837 1094.7011 1108.3783 1152.5106 1164.8095 1169.0589 1197.5209 1237.5058 1244.0373 1280.4451 1282.6277 1295.9706 1325.7881 1339.9227 1356.7418 1363.7984 1384.6306 1387.7500 1389.0213 1390.4101 1452.2943 1456.1205 1460.8481 1464.6921 1470.7424 1472.4726 1474.3716 1476.5202 1479.1025 1484.1030 1485.9915 1487.2607 1493.5096 1663.5726 2971.5064 2974.3160 2978.3844 2979.9803 2987.1551 2989.0810 2989.8182 3018.9325 3023.9662 3043.9492 3048.7642 3068.8183 3072.5399 3074.3714 3077.3556 3080.3704 3084.0277 3086.8978 3091.7102 3113.5149 3552.4926
redmass: 3.2775 2.8020 1.7269 3.7607 4.5704 2.5704 1.9477 2.6791 2.2282 1.1645 1.2367 1.1998 1.4093 2.0923 3.1234 2.4617 2.9544 2.5517 3.4942 3.0428 3.0714 2.5958 1.1323 2.8877 4.5850 8.7559 1.1844 2.9094 1.2666 1.2015 2.1979 2.0889 1.6842 2.3905 1.7664 2.0959 1.8104 1.6555 2.4945 2.5983 2.9791 1.4969 2.1360 2.2956 1.7085 2.2007 2.3157 2.1966 3.7232 1.2862 1.1503 1.1094 1.3921 1.3205 1.4509 1.2633 1.3767 1.2469 1.2305 1.2208 1.2290 1.1211 1.0723 1.0555 1.1281 1.0631 1.2889 1.0524 1.0491 1.0791 1.0667 1.0912 1.1144 1.0869 8.4448 1.0430 1.0514 1.0523 1.0447 1.0427 1.0366 1.0545 1.0978 1.0593 1.0999 1.1007 1.1000 1.0990 1.1001 1.1000 1.0997 1.0977 1.1032 1.0990 1.1053 1.0770
irintensity: 0.4636 1.0160 0.1440 4.4225 3.5220 0.1080 0.8843 0.7542 1.4390 0.7215 3.0086 0.3045 0.0218 0.3560 4.7246 6.5190 8.8294 0.4513 5.4399 3.1733 1.8538 0.7878 101.7226 1.2658 11.0881 22.5922 8.6009 2.6197 17.6467 3.3959 1.6982 3.9043 2.3545 33.5202 6.3023 8.8031 7.9839 14.8779 89.3008 105.5722 56.1730 1.0373 31.9340 1.3976 68.5144 20.8739 69.5645 1.3471 153.2427 1.0549 0.9446 3.2573 7.8734 1.8588 7.7039 6.4397 9.1566 9.3306 29.0554 12.4425 34.5184 20.1100 2.0437 16.5908 57.0812 24.9466 167.1870 2.0050 3.9662 16.1035 34.1343 19.5356 42.5592 36.9971 203.7763 35.1433 14.3688 20.9063 31.1044 48.1021 28.3061 25.5433 6.3545 36.9177 2.0857 7.4170 62.7942 21.4711 67.5990 59.8922 45.2651 35.7551 3.2233 32.0451 37.8449 29.8389
temp: 298.150 k
press: 1.00000 atm
elementType: 8 8 7 6 6 6 6 6 6 6 6 6 6 1 1 1 1 1 1 1 1 1 1 1 1 1 1 1 1 1 1 1 1 1
symmnumber: 1
zpe: 785607.3 jmol-1
zpe.correction: 0.299222 hartree
zpe.thermalcorrener: 0.316117 hartree
zpe.thermalcorrenthalpy: 0.317061 hartree
zpe.thermalcorrgfe: 0.254064 hartree
zpe.sumelectzpe: -597.803031 hartree
zpe.sumelectthermal: -597.786136 hartree
zpe.sumelectthermalent: -597.785191 hartree
zpe.sumelectthermalfe: -597.848188 hartree
dipole: 0.4259 0.7350 1.8391
dipole: 2.0258
quadrupole: -73.6142 -80.7539 -84.2849
quadrupole: 3.5577 -0.3528 -0.5450
quadrupole: 5.9368 -1.2029 -4.7339 3.5577 -0.3528 -0.5450
hfenergy: -598.1022527 hartree
pointgroup: C01[X(C10H21N1O2)]
dipole: -0.1993093 0.1767866 -0.751182 debye
polarizability: 140.9173463|-1.2385707|119.7696248|1.2396831|-2.2978434|107.5329724 unknown
InChI: InChI=1S/C10H21NO2/c1-5-8-10(4,6-2)11-9(12)13-7-3/h11H,5-8H2,1-4H3
charge 0 multiplicity 1
34 atoms
O  2.184223 -0.56449 -0.921549
O  1.157289 -0.309165 1.192252
N  0.028707 0.135443 -0.835483
C  -1.310774 0.538485 -0.307351
C  -1.935991 -0.625069 0.529466
C  -1.169359 1.788738 0.622895
C  -2.180554 0.863366 -1.544723
C  -2.155905 -1.957997 -0.219637
C  -0.532433 3.034538 -0.026288
C  -2.620723 -3.08184 0.732914
C  1.10056 -0.240202 -0.065719
C  3.450282 -0.933837 -0.233101
C  4.267855 0.311919 0.123411
H  -2.904957 -0.264907 0.931604
H  -1.275228 -0.805419 1.3988
H  -2.181674 2.039071 0.998094
H  -0.567702 1.485023 1.499607
H  -3.19619 1.152706 -1.223766
H  -1.755199 1.700309 -2.127033
H  -2.272446 -0.010833 -2.21408
H  -2.907877 -1.830842 -1.02352
H  -1.21112 -2.261746 -0.712328
H  0.177529 0.128672 -1.84589
H  0.460697 2.797455 -0.449812
H  -0.39167 3.829066 0.729086
H  -1.158885 3.455082 -0.833977
H  -2.782006 -4.031331 0.1899
H  -3.570544 -2.812941 1.233174
H  -1.86712 -3.264605 1.521418
H  3.203618 -1.517944 0.671281
H  3.969607 -1.572504 -0.966283
H  5.240589 0.013177 0.557494
H  4.463005 0.924937 -0.773729
H  3.732497 0.924891 0.868074
