program: Gaussian 09
title: 000270749
version: EM64L-G09RevD.01
frameworkgroup: C1[X(C7H11N5O2)]
method: RPBEPBE
basis: SDD
operation: Freq
keyword: #p
keyword: freq=noraman
keyword: PBEPBE/SDD
title: #p freq=noraman PBEPBE/SDD
converged: NO YES NO NO
title: Mulliken charges:
elementType: O O N N N N N C C C C C C C H H H H H H H H H H H
charge: -0.405431 -0.280926 -0.091752 -0.379145 -0.150245 -0.057686 -0.635043 0.264003 0.037041 -0.648720 -0.633379 0.164285 -0.464353 0.168414 0.230215 0.250584 0.256843 0.220189 0.294439 0.253252 0.341780 0.236063 0.326299 0.345590 0.357681
chargesum: 0.00000
title: Mulliken charges with hydrogens summed into heavy atoms:
elementType: O O N N N N N C C C C C C C
charge: -0.047749 -0.280926 -0.091752 -0.037365 -0.150245 -0.057686 0.036846 0.264003 0.037041 0.088923 0.134501 0.164285 -0.228290 0.168414
polarizability: 1.93602237e+02 -1.53383097e+00 1.24721473e+02 7.75423112e+00 3.84730760e-01 7.38252524e+01
1716.lowfreq: -0.0010 -0.0008 0.0005 3.5171 9.2934 14.5526 44.3400 60.9521 78.5505
frequency: 44.3029 60.9227 78.5410 118.6246 153.6210 177.9631 182.8941 214.0813 229.8800 250.9369 273.0871 310.2616 348.7289 386.0873 426.7537 428.2523 465.1183 497.8362 523.9338 544.5035 556.9150 582.6099 637.4506 651.4246 665.2420 723.2583 728.5263 751.0441 762.4831 788.9152 923.3320 930.2432 980.6313 1034.0346 1061.0612 1090.1170 1098.5377 1130.6038 1174.1320 1194.6686 1213.8605 1230.9713 1252.8280 1309.5495 1383.3951 1415.3445 1428.3327 1448.1058 1460.3346 1471.8892 1484.0449 1488.6850 1501.8138 1527.1922 1542.9052 1593.5370 1619.3536 1652.2695 2957.8524 2984.3492 3055.3700 3078.3041 3097.8833 3101.4675 3171.2735 3529.5075 3542.0070 3574.3749 3692.3921
redmass: 5.3860 3.3696 3.8788 2.1466 1.6877 5.9811 4.8459 1.0858 5.3233 3.6619 4.7801 3.5473 4.9719 2.7563 1.1399 2.5753 1.2647 6.1995 4.4132 5.3150 1.2809 6.0008 5.2274 3.0744 3.1451 2.5606 6.6380 1.7946 5.1518 2.6093 4.7421 4.2675 3.4692 1.9134 1.5086 1.8841 1.2370 1.3902 1.3504 3.0456 3.5283 2.7633 2.6903 2.2385 3.6689 1.4874 1.1541 3.3399 1.1296 1.2230 1.0642 1.0547 2.7660 3.7002 5.8537 3.5077 1.4547 6.6142 1.0420 1.0338 1.0920 1.1024 1.1010 1.1006 1.0930 1.0773 1.0452 1.0654 1.1042
irintensity: 0.0635 2.4024 4.2904 6.8873 0.6212 0.6804 9.1045 0.0229 4.1552 17.1068 11.8200 14.6779 16.1119 2.2352 112.6622 33.9429 94.5689 1.8307 30.0525 3.7067 135.4780 1.5446 9.3183 32.2054 29.1702 17.1569 21.9519 22.0286 1.7314 105.8801 12.8371 22.1672 60.6291 97.4965 13.1550 38.4614 0.0840 0.6367 134.5958 178.9239 63.6301 38.6534 11.4715 5.9657 32.7501 47.5677 24.8376 259.0102 78.0035 5.9311 19.0454 5.2731 108.5522 237.6987 808.1266 1065.3289 586.1463 366.4939 74.9685 43.5892 22.3667 11.5082 8.7272 19.8020 2.5814 42.9426 59.5244 34.6454 31.6625
temp: 298.150 k
press: 1.00000 atm
elementType: 8 8 7 7 7 7 7 6 6 6 6 6 6 6 1 1 1 1 1 1 1 1 1 1 1
symmnumber: 1
zpe: 508357.6 jmol-1
zpe.correction: 0.193623 hartree
zpe.thermalcorrener: 0.207606 hartree
zpe.thermalcorrenthalpy: 0.208550 hartree
zpe.thermalcorrgfe: 0.152981 hartree
zpe.sumelectzpe: -696.506265 hartree
zpe.sumelectthermal: -696.492282 hartree
zpe.sumelectthermalent: -696.491338 hartree
zpe.sumelectthermalfe: -696.546907 hartree
dipole: -8.4694 1.5868 0.1255
dipole: 8.6177
quadrupole: -73.2932 -79.5390 -81.4466
quadrupole: 17.7829 -3.1066 6.1437
quadrupole: 4.7997 -1.4460 -3.3537 17.7829 -3.1066 6.1437
hfenergy: -696.6998881 hartree
pointgroup: C01 [X(C7H11N5O2)]
dipole: 3.1956296 0.2858865 -1.0960907 debye
dipolederiv: -0.1594199 0.0300078 -0.0434226 0.1710752 -1.3830682 0.245854 -0.0888578 0.3020175 -0.5017011 -1.1410647 -0.3820126 0.2472141 -0.5823494 -0.8004408 0.2214432 0.2771234 0.1768445 -0.4902438 -0.7976673 0.0012306 0.2042203 -0.2750919 -0.337302 0.283888 0.4376298 0.2190524 -1.0102663 -1.3880295 -0.1479901 0.2523994 -0.0084482 -0.4052854 0.0215315 0.1577264 0.0595339 -0.3157553 -2.7258299 0.2858129 0.3626423 0.0150986 -0.6023802 0.1863552 -0.0017617 0.1526244 -0.5271635 -1.2922552 0.3395076 0.0724503 1.1233653 -0.9997371 0.0277544 -0.1990104 0.1467025 -0.2669998 -1.1564617 0.176092 -0.4769769 0.0258057 -0.652629 -0.0224954 -0.5352826 0.0538212 -0.6936832 2.5806557 -0.2230057 -0.0830159 0.5321604 0.3928574 -0.6277497 -0.3278036 -0.4460047 1.4772983 2.2694011 -0.1880216 -0.3397453 -0.9850297 1.102902 -0.0766326 0.3241482 -0.3067255 0.2216483 0.5573107 0.0642023 -0.2762903 -0.0067482 0.2427324 0.0105674 -0.1287743 0.015201 0.1169731 0.1038601 -0.0704936 0.2165693 -0.0759868 0.1111228 0.0243107 0.031401 0.0412259 0.3270236 1.683322 0.3281461 -0.3501595 0.6275063 1.0925259 -0.3733905 -0.3680636 -0.3239689 0.3531118 -0.619242 -0.2448025 0.1393857 -0.4418629 -0.795237 0.2063953 0.186807 0.1872431 -0.4012895 1.551936 -0.1291478 -0.1761731 -0.4249589 1.5730872 -0.3327191 -0.0670086 -0.4324421 0.3214216 -0.1365195 0.0245449 0.1255051 0.1180708 -0.0245856 -0.0811643 0.1266838 -0.0442054 0.0193909 0.0127305 -0.0429211 -0.0270074 -0.0139557 0.0953297 -0.0312211 -0.1005703 -0.094183 -0.0308352 0.025334 0.0636769 -0.004054 -0.0443616 -0.01135 0.1295758 0.0420055 0.117084 0.0249244 -0.011681 0.0375272 0.1321507 0.0375658 0.1202231 -0.0384078 0.0910314 -0.0153701 -0.1379143 0.0819519 0.0522131 -0.0928755 0.0737811 -0.0163705 0.0408346 -0.0593542 -0.0150316 0.0990915 0.000453 -0.0813207 -0.0420084 -0.0857469 -0.016191 0.0033626 -0.0040224 0.075694 0.1011104 0.1851165 0.0043068 0.0054482 0.0497742 0.2037309 0.030373 -0.020811 0.0457168 0.3145267 -0.0315382 0.0820085 0.0087627 0.0612571 0.0397831 0.0456396 0.0052185 0.0452827 0.1927085 0.1388549 0.0175716 0.0678464 0.1576331 0.3230678 0.0400533 0.0748601 0.0204209 0.180911 0.2326869 -0.0186798 0.0361899 -0.0104423 0.342407 0.0655223 0.0883093 0.0290637 0.259401 0.0360956 0.0215472 0.0409445 -0.0381113 0.4048076 0.0003196 0.0583761 -0.0095968 0.3663109 unknown
polarizability: 190.6022234|-5.361283|110.7261307|-19.0498117|-22.2660465|90.820609 unknown
InChI: InChI=1S/C7H11N5O2/c1-12(2)6(8)11-7-9-4(13)3-5(14)10-7/h3,9,14H,8H2,1-2H3
charge 0 multiplicity 1
25 atoms
O  -1.625373 2.709124 -0.457181
O  -3.730929 -1.397128 1.137848
N  2.338176 -0.205768 -1.13959
N  -1.427116 -1.185467 0.7681
N  0.886199 -1.142851 0.576517
N  -0.384826 0.82529 0.001508
N  3.174027 -1.017613 0.907737
C  2.079734 -0.760479 0.095505
C  -0.293538 -0.464324 0.405258
C  3.611636 0.474721 -1.439189
C  1.325921 -0.205648 -2.210746
C  -2.763992 -0.657544 0.777452
C  -2.819466 0.726018 0.348051
C  -1.639357 1.380055 -0.01653
H  4.339107 -0.193448 -1.944183
H  4.060464 0.873374 -0.51418
H  3.410576 1.329884 -2.106745
H  1.836518 -0.311458 -3.184295
H  0.727653 0.722486 -2.184888
H  0.642248 -1.06067 -2.081495
H  -1.301162 -2.149547 1.090106
H  -3.801076 1.206939 0.324386
H  4.116743 -1.130616 0.542447
H  2.959643 -1.355687 1.843339
H  -2.54451 3.078262 -0.446734
