program: Gaussian 09
title: 000270748
version: EM64L-G09RevD.01
frameworkgroup: C1[X(C9H15N5O)]
method: RPBEPBE
basis: SDD
operation: Freq
keyword: #p
keyword: freq=noraman
keyword: PBEPBE/SDD
title: #p freq=noraman PBEPBE/SDD
converged: NO YES NO NO
title: Mulliken charges:
elementType: O N N N N N C C C C C C C C C H H H H H H H H H H H H H H H
charge: -0.270491 -0.418126 -0.093169 -0.042353 -0.172166 -0.636614 0.323601 0.090577 -0.009805 -0.767539 -0.055306 -0.806705 0.250419 -0.647138 -0.630885 0.315044 0.248516 0.249095 0.210892 0.208737 0.281870 0.214708 0.249259 0.259500 0.223965 0.213787 0.311512 0.241061 0.320402 0.337350
chargesum: 0.00000
title: Mulliken charges with hydrogens summed into heavy atoms:
elementType: O N N N N N C C C C C C C C C
charge: -0.270491 -0.103082 -0.093169 -0.042353 -0.172166 0.021138 0.323601 0.090577 -0.009805 -0.059036 -0.055306 -0.101390 0.250419 0.085586 0.135475
polarizability: 2.10884446e+02 4.00393917e+00 1.48368397e+02 3.88859542e+00 1.74119752e-02 8.76179048e+01
1716.lowfreq: -33.4411 -10.3998 0.0003 0.0008 0.0009 2.4611 11.2945 41.0373 50.7277
frequency: -33.2079 40.9226 50.5222 65.0720 96.1848 105.3639 113.5257 152.6819 189.8152 192.3071 220.5260 246.5392 260.3758 283.0291 306.3068 326.7479 350.4457 373.6198 412.2098 464.4309 492.1641 518.7482 542.4633 555.9798 563.1360 582.4819 637.9661 652.9689 698.2927 718.9419 735.4689 762.5306 796.5840 903.2907 964.8127 988.2765 1021.0815 1028.1047 1051.1027 1052.5533 1063.5207 1096.8706 1124.4356 1130.0280 1156.3832 1231.9254 1237.7226 1248.8068 1285.2382 1347.9661 1388.6884 1401.0179 1404.4237 1423.3236 1426.7011 1453.7717 1456.9524 1458.5704 1468.7505 1478.8795 1483.0249 1487.3621 1490.7805 1508.2729 1529.6332 1561.5836 1595.3281 1619.4065 1636.7069 2954.9810 2961.9436 2975.5329 2982.1153 3033.6494 3048.0117 3067.8825 3071.1602 3081.0657 3091.7227 3093.5691 3101.6437 3541.3790 3546.9359 3694.0427
redmass: 1.0235 4.2243 3.0418 3.0974 1.4954 2.1031 2.0713 1.7273 3.0412 1.1582 4.6802 3.4067 3.4342 2.7280 3.2696 3.9281 4.4615 3.3188 2.5297 1.2395 3.4802 6.9802 1.2228 4.9772 4.3978 4.6346 1.2492 3.9270 7.0049 8.0621 5.0642 7.0780 5.6418 2.8679 2.7956 1.7188 1.3992 2.0275 1.5407 1.8524 1.5155 1.2284 2.6696 1.4149 4.4043 3.5948 4.6178 2.5292 1.9414 5.8625 1.2931 1.6766 1.2447 1.4081 2.1137 1.0772 1.0493 1.0897 1.2096 1.1344 1.0592 1.0672 1.0490 2.3173 3.9697 4.7799 2.9904 1.6094 7.6897 1.0419 1.0380 1.0340 1.0366 1.0978 1.0929 1.0978 1.1022 1.0999 1.0965 1.1004 1.0998 1.0452 1.0778 1.1039
irintensity: 0.2484 6.0589 6.9933 2.6800 0.4462 0.2269 5.4211 0.2111 0.6084 0.1643 1.1163 4.8169 15.2595 2.1389 9.5788 12.2204 11.8421 0.4221 41.2620 115.9707 21.4176 1.9049 116.5609 8.2161 1.3492 2.1751 87.9692 3.5838 13.0467 20.2959 3.4903 10.2192 2.9491 2.6748 11.2025 37.1025 6.1197 6.5242 2.9049 62.0947 9.7898 0.6936 44.1796 0.5714 89.9990 28.6124 48.4889 30.9812 28.4696 45.9318 51.6687 17.7239 36.0491 91.6888 137.0132 34.9089 12.6562 22.9838 15.1030 23.4314 11.9451 7.1495 23.6415 358.9976 824.3725 43.1960 599.1519 546.6479 150.3355 85.1951 58.7736 54.1833 22.3526 33.8861 22.9798 9.1362 10.7565 20.2725 2.1306 19.5753 12.9645 47.7015 42.9042 28.3194
temp: 298.150 k
press: 1.00000 atm
elementType: 8 7 7 7 7 7 6 6 6 6 6 6 6 6 6 1 1 1 1 1 1 1 1 1 1 1 1 1 1 1
symmnumber: 1
zpe: 639758.6 jmol-1
zpe.correction: 0.243671 hartree
zpe.thermalcorrener: 0.259419 hartree
zpe.thermalcorrenthalpy: 0.260363 hartree
zpe.thermalcorrgfe: 0.200520 hartree
zpe.sumelectzpe: -699.808703 hartree
zpe.sumelectthermal: -699.792955 hartree
zpe.sumelectthermalent: -699.792011 hartree
zpe.sumelectthermalfe: -699.851854 hartree
dipole: -4.3596 -6.0420 2.0158
dipole: 7.7185
quadrupole: -57.2728 -94.6992 -89.0886
quadrupole: -9.9660 3.9782 6.3981
quadrupole: 23.0808 -14.3457 -8.7351 -9.9660 3.9782 6.3981
hfenergy: -700.0523737 hartree
pointgroup: C01 [X(C9H15N5O1)]
dipole: -1.8206445 -2.4194184 -0.23077 debye
polarizability: 210.4563013|3.4103218|133.5619151|-9.2221772|25.7098548|102.8525315 unknown
InChI: InChI=1S/C9H15N5O/c1-5-6(2)11-9(12-7(5)15)13-8(10)14(3)4/h11H,10H2,1-4H3
charge 0 multiplicity 1
30 atoms
O  1.616805 2.228982 0.773587
N  0.907919 -1.600807 -0.400514
N  -2.82413 -0.054478 1.209519
N  0.075239 0.538895 0.274322
N  -1.381864 -1.310863 -0.310013
N  -3.634553 -1.031158 -0.771669
C  2.24074 -1.183619 -0.355051
C  2.523902 0.117791 0.02116
C  -0.14634 -0.726451 -0.097137
C  3.290376 -2.205616 -0.730175
C  1.405781 1.035345 0.378679
C  3.937212 0.649878 0.09379
C  -2.553829 -0.777943 0.065314
C  -3.989488 0.842088 1.31457
C  -1.896039 -0.045714 2.353708
H  0.65085 -2.542261 -0.7027
H  3.996122 -2.371295 0.104145
H  3.887538 -1.857281 -1.592477
H  2.842708 -3.17984 -0.996097
H  4.576135 0.05487 0.775292
H  3.895544 1.68623 0.467959
H  4.43101 0.65841 -0.897943
H  -4.354816 1.113535 0.310886
H  -3.679255 1.772511 1.8222
H  -4.817672 0.390814 1.899049
H  -2.482047 0.05514 3.285127
H  -1.164833 0.777016 2.256128
H  -1.339334 -0.996942 2.390746
H  -4.593812 -1.044328 -0.432714
H  -3.414073 -1.478707 -1.658092
