program: Gaussian 09
title: 000270732
version: EM64L-G09RevD.01
frameworkgroup: C1[X(C23H23N3O11)]
method: RPBEPBE
basis: SDD
operation: Freq
keyword: #p
keyword: freq=noraman
keyword: PBEPBE/SDD
title: #p freq=noraman PBEPBE/SDD
converged: YES YES NO NO
title: Mulliken charges:
elementType: O O O O O O O O O O O N N N C C C C C C C C C C C C C C C C C C C C C C C H H H H H H H H H H H H H H H H H H H H H H H
charge: -0.246061 -0.282483 -0.278676 -0.289954 -0.293008 -0.236929 -0.237920 -0.197266 -0.199457 -0.198467 -0.199538 -0.126397 0.028408 0.027389 -0.173435 -0.120152 -0.091378 -0.040883 -0.290182 -0.659198 0.233301 0.236090 -0.499461 -0.808256 0.218116 0.226487 0.218729 -0.316991 -0.313115 -0.353416 -0.344764 -0.323516 -0.305058 0.388741 -0.354609 -0.364523 0.388133 0.285941 0.340626 0.290673 0.268182 0.232432 0.265682 0.241715 0.256128 0.247018 0.238747 0.220808 0.229062 0.240657 0.273193 0.235593 0.282508 0.270332 0.293029 0.289966 0.281902 0.309506 0.292819 0.293177
chargesum: 0.00000
title: Mulliken charges with hydrogens summed into heavy atoms:
elementType: O O O O O O O O O O O N N N C C C C C C C C C C C C C C C C C C C C C C C
charge: -0.246061 -0.282483 -0.278676 -0.289954 -0.293008 -0.236929 -0.237920 -0.197266 -0.199457 -0.198467 -0.199538 -0.126397 0.028408 0.027389 0.112506 0.220473 0.199295 0.227299 0.207933 0.085662 0.233301 0.236090 0.189156 -0.058813 0.218116 0.226487 0.218729 -0.034482 -0.042782 -0.060386 -0.054798 -0.041614 0.004448 0.388741 -0.061790 -0.071345 0.388133
polarizability: 3.37264663e+02 3.74669292e+01 3.83492974e+02 2.41657761e+01 -2.00661545e+01 2.41021487e+02
1716.lowfreq: -2.6154 -0.0001 0.0002 0.0009 0.6329 4.2158 8.1362 13.9344 15.3361
frequency: 8.0343 13.9103 15.3327 21.1418 24.4822 39.2470 44.9414 48.6805 50.1525 55.8865 63.2499 65.4126 74.2419 79.7485 85.3491 91.7705 95.2619 113.7829 117.2185 126.9164 143.3772 159.5065 173.5968 180.1032 186.2182 202.7328 208.8065 218.9256 246.0034 260.3343 264.3849 270.7720 277.6335 280.3378 289.7184 308.5411 340.0651 359.5986 396.7093 409.2223 413.7862 424.7741 435.7624 456.2468 460.0255 464.2776 485.8569 488.4318 494.8159 517.3002 520.7383 568.8498 580.3319 585.7990 601.1107 610.3195 622.8062 624.1600 651.9713 653.8271 682.9864 684.4364 687.8109 690.6210 720.8286 763.2672 766.1788 767.7568 776.6525 781.8411 791.8499 814.5555 834.9789 856.3183 861.4406 873.2309 876.5191 887.3097 897.6388 913.7858 949.6033 978.7017 985.9046 1000.6013 1002.6377 1005.4723 1006.5868 1009.2837 1011.2650 1022.4052 1028.6167 1030.6854 1044.8670 1055.8229 1071.1383 1077.4983 1089.0097 1089.3112 1108.0868 1109.8335 1112.7666 1113.6532 1114.6582 1135.6625 1142.7966 1157.3027 1174.6367 1182.6158 1200.8408 1207.5607 1213.9691 1215.2786 1229.3447 1239.9965 1254.1066 1262.3186 1286.2866 1292.0166 1299.7613 1306.2978 1328.8011 1340.1239 1347.9694 1356.8263 1366.8607 1368.8093 1369.2202 1377.5547 1404.6040 1405.4405 1414.8402 1415.2985 1415.5606 1431.5387 1445.9667 1453.5720 1457.2991 1459.0989 1470.2290 1475.2087 1476.3710 1476.9372 1486.4711 1494.1795 1583.3947 1590.4699 1590.9257 1609.2538 1610.3744 1625.0492 1625.7865 2964.9172 2975.4190 2989.8983 3008.6966 3049.0261 3051.8051 3056.1066 3061.9341 3062.5931 3076.1582 3083.7314 3086.9979 3118.1024 3130.0139 3134.0870 3156.0501 3163.5140 3165.1027 3174.4726 3184.7426 3188.2427 3189.2522 3192.5293
redmass: 10.1052 6.4722 8.4976 5.3822 6.1470 6.0453 8.8694 6.4554 5.3626 4.2313 3.7244 6.1947 5.5873 4.9090 5.0229 4.5340 1.3471 4.1377 3.2339 2.4295 4.6851 4.1020 2.8553 5.5880 4.7160 1.3974 5.3502 5.2114 5.0607 5.3857 6.5684 5.3102 8.3276 5.4496 7.1446 3.8053 3.3025 3.8504 6.0037 2.8748 2.9516 6.1329 4.3495 4.4175 4.2962 4.9046 8.2741 8.0388 5.1718 6.1969 5.4452 5.2291 3.6093 4.0535 6.2603 5.3282 7.1018 7.1375 6.2852 6.4322 4.8127 5.3267 4.5725 7.6796 5.6260 5.0185 5.2631 4.6533 9.0973 8.7388 3.4629 8.1568 7.0808 3.6195 1.2801 1.2888 4.0891 1.6625 1.6075 5.4905 6.4029 2.4072 2.4535 1.3999 3.4942 3.2279 3.1437 1.3554 1.3820 2.5386 1.3690 1.6917 2.5724 3.8097 4.6836 4.9860 3.0748 3.2531 1.3495 1.9376 1.6135 1.2711 1.3277 2.1309 1.5184 2.0263 1.2248 1.2978 3.0499 1.8096 3.9052 3.9480 1.6584 3.4920 2.2289 2.1186 1.3387 1.2610 1.2708 1.2295 1.5056 1.5546 1.1962 1.5772 1.7491 7.7404 7.8732 1.3036 8.7388 8.3060 1.4260 4.0470 4.5447 1.1473 1.1182 1.0832 1.0513 1.1554 1.2330 2.4014 2.3723 1.0630 1.0493 1.0969 5.6659 8.4876 8.9518 6.2712 6.4352 10.9766 10.8955 1.0331 1.0391 1.0384 1.0599 1.0857 1.0994 1.0881 1.0850 1.1006 1.0982 1.1045 1.0864 1.1020 1.0976 1.0958 1.0924 1.0904 1.0902 1.0889 1.0949 1.0958 1.0962 1.0974
irintensity: 0.2407 0.6400 0.3242 0.6247 0.3170 1.5435 0.8896 0.3396 0.9546 1.4959 3.6820 0.4875 1.4841 2.2349 1.3583 4.6355 1.0942 1.7364 0.1887 4.5393 10.4313 1.9798 4.0621 5.4983 5.4971 2.0871 1.8888 1.5027 8.2549 1.5297 6.3792 1.7036 2.7181 5.8749 2.0712 1.0230 8.9497 6.4041 3.1788 0.0122 0.2210 24.6076 31.5091 3.1370 1.3103 5.3211 12.8720 0.8837 6.1746 0.9752 4.1381 4.4380 8.0229 7.5785 0.6730 5.1866 0.0631 0.3945 0.1134 0.2564 35.8986 33.2588 32.1953 14.9855 18.6353 1.1417 6.4532 18.7419 27.2879 23.9304 6.0056 16.8926 13.0708 58.7649 3.8163 6.4737 8.5455 49.0385 37.2719 153.9810 16.2290 7.3601 37.9178 2.7089 13.7262 21.3726 46.0584 0.4135 0.6907 98.1542 8.4181 8.5875 48.3284 203.0221 227.4964 249.3710 4.3501 15.7388 8.5687 40.0694 13.3409 0.2629 0.2301 16.9645 60.5910 46.5975 4.1252 14.3418 36.6264 136.2741 175.7548 611.8944 2.2289 170.6334 146.5098 96.8391 22.6733 0.4394 6.1481 4.0363 22.7956 12.7054 18.3638 9.2870 55.8013 120.2637 48.5027 68.3955 5.3607 9.2565 37.0604 71.9328 64.0419 6.5370 45.8557 15.8011 19.1393 12.5903 23.4307 5.9471 3.7248 13.7716 2.5843 39.8823 167.9784 37.6417 43.6664 4.6424 3.9592 150.9774 167.7842 55.7160 38.3812 7.1286 17.6194 5.0009 36.4212 22.2205 12.3615 32.7711 12.5940 9.2798 0.9442 20.9689 15.2286 8.2021 10.4572 1.6510 1.3578 1.5754 1.9391 0.3486 0.6496 1.5103
temp: 298.150 k
press: 1.00000 atm
elementType: 8 8 8 8 8 8 8 8 8 8 8 7 7 7 6 6 6 6 6 6 6 6 6 6 6 6 6 6 6 6 6 6 6 6 6 6 6 1 1 1 1 1 1 1 1 1 1 1 1 1 1 1 1 1 1 1 1 1 1 1
symmnumber: 1
zpe: 1162526.0 jmol-1
zpe.correction: 0.442783 hartree
zpe.thermalcorrener: 0.478487 hartree
zpe.thermalcorrenthalpy: 0.479431 hartree
zpe.thermalcorrgfe: 0.367879 hartree
zpe.sumelectzpe: -1879.087032 hartree
zpe.sumelectthermal: -1879.051328 hartree
zpe.sumelectthermalent: -1879.050384 hartree
zpe.sumelectthermalfe: -1879.161936 hartree
dipole: -1.6193 -5.5012 -2.6258
dipole: 6.3072
quadrupole: -248.3042 -269.2919 -198.7211
quadrupole: -8.1697 3.9654 25.7774
quadrupole: -9.5318 -30.5195 40.0513 -8.1697 3.9654 25.7774
hfenergy: -1879.5298151 hartree
pointgroup: C01 [X(C23H23N3O11)]
dipole: -0.3902489 -2.2560878 -0.9567111 debye
polarizability: 328.9732982|33.3794739|389.1477823|26.7143736|-22.3843667|243.658044 unknown
InChI: InChI=1S/C23H23N3O11/c1-13(27)24(2)19-18(12-35-21(28)14-4-8-16(9-5-14)25(30)31)36-23(34-3)20(19)37-22(29)15-6-10-17(11-7-15)26(32)33/h4-11,18-20,23H,12H2,1-3H3
charge 0 multiplicity 1
60 atoms
O  -0.987456 -2.952834 1.9929
O  1.781715 -1.13355 0.361594
O  -0.378959 -0.599057 1.963279
O  -2.758432 -1.736966 -0.072461
O  1.250816 -5.119886 -0.062394
O  2.977702 -1.139336 2.362512
O  -5.023146 -2.060957 -0.523129
O  6.671494 4.316402 -0.167499
O  5.363891 4.320124 -2.036905
O  -5.513713 4.986279 -0.92149
O  -3.357689 5.157644 -0.196578
N  0.49851 -3.378809 -1.39827
N  5.706212 3.850142 -0.884964
N  -4.395766 4.470429 -0.536038
C  -0.03525 -2.656515 -0.224898
C  0.990131 -2.276355 0.864637
C  -1.131444 -3.41836 0.580402
C  0.095793 -1.961896 2.084329
C  -2.558853 -3.197569 0.097597
C  0.411349 -2.6641 -2.68754
C  1.154259 -4.597839 -1.221112
C  2.757367 -0.644345 1.231633
C  -1.131578 -0.16359 3.153492
C  1.743489 -5.285757 -2.448667
C  -4.049777 -1.291804 -0.339523
C  3.496374 0.517415 0.649538
C  -4.10431 0.202854 -0.380568
C  4.569724 1.061974 1.401593
C  3.149359 1.077239 -0.607468
C  5.300455 2.156213 0.905196
C  3.871522 2.172774 -1.115927
C  -5.318252 0.813138 -0.788861
C  -2.985601 0.997961 -0.013244
C  4.937673 2.692669 -0.349729
C  -5.422599 2.214784 -0.843193
C  -3.080004 2.401688 -0.063107
C  -4.296322 2.985892 -0.480206
H  -0.468133 -1.710442 -0.592199
H  1.659088 -3.116337 1.109479
H  -0.915308 -4.500791 0.582278
H  0.580284 -2.121725 3.063025
H  -2.735525 -3.701822 -0.871329
H  -3.286734 -3.579693 0.834067
H  -0.624796 -2.322936 -2.865237
H  0.697836 -3.322529 -3.519219
H  1.075976 -1.778834 -2.695849
H  -2.039444 -0.778933 3.288267
H  -0.49673 -0.229434 4.059398
H  -1.408468 0.886096 2.971947
H  2.503295 -4.66019 -2.95121
H  2.223073 -6.213548 -2.104502
H  0.967392 -5.54576 -3.191891
H  4.812687 0.613164 2.369611
H  2.313707 0.652235 -1.168546
H  6.132497 2.59668 1.460001
H  3.629651 2.629592 -2.078796
H  -6.164929 0.173104 -1.055827
H  -2.063469 0.509772 0.318498
H  -6.342046 2.716128 -1.155335
H  -2.241283 3.046106 0.212138
