program: Gaussian 09
title: 000270729
version: EM64L-G09RevD.01
frameworkgroup: C1[X(C26H22O4)]
method: RPBEPBE
basis: SDD
operation: Freq
keyword: #pfreq=noraman
keyword: PBEPBE/SDD
title: #p freq=noraman PBEPBE/SDD
converged: YES YES NO NO
title: Mulliken charges:
elementType: O O O O C C C C C C C C C C C C C C C C C C C C C C C C C C H H H H H H H H H H H H H H H H H H H H H H
charge: -0.396833 -0.157134 -0.284139 -0.137169 -0.392265 -0.595097 -0.556415 0.234652 0.008908 0.511026 0.340143 -0.162632 0.291206 -0.208507 -0.448643 -0.372984 -0.380918 -0.374388 -0.347306 -0.390237 0.359901 -0.221537 -0.232130 -0.406746 0.414811 -0.390756 -0.411667 -0.218131 -0.224954 -0.240089 0.218029 0.251904 0.198801 0.283059 0.200104 0.220030 0.227061 0.239231 0.287077 0.291501 0.246415 0.249569 0.239748 0.242545 0.378894 0.221419 0.220962 0.264420 0.227007 0.226863 0.226495 0.228897
chargesum: 0.00000
title: Mulliken charges with hydrogens summed into heavy atoms:
elementType: O O O O C C C C C C C C C C C C C C C C C C C C C C C C C C
charge: -0.017939 -0.157134 -0.284139 -0.137169 0.077667 -0.113238 -0.136281 0.234652 0.008908 0.511026 0.340143 -0.162632 0.291206 -0.208507 -0.221582 -0.133753 -0.093841 -0.082888 -0.100891 -0.140668 0.359901 0.018211 0.010415 0.035635 0.414811 -0.126336 -0.184660 0.008732 0.001541 -0.011192
polarizability: 3.95807264e+02 -1.77674142e+01 2.42153819e+02 -1.12786395e+01 -2.31278263e+01 2.80491173e+02
1716.lowfreq: -9.0861 -3.2447 -0.0006 0.0008 0.0010 0.6066 9.9859 10.8035 12.8458
frequency: 7.7850 10.0970 12.6127 21.3478 28.9375 35.9768 51.8759 58.8401 73.0757 95.4514 104.1825 119.7763 129.0422 156.1721 177.2200 200.0703 211.4087 240.7936 250.4336 274.1328 312.2474 330.1341 337.2735 348.0438 361.3441 393.6125 400.6600 402.2801 412.0272 413.7612 417.0511 446.5335 456.4389 478.7857 484.1691 490.0186 510.4233 540.6750 568.5573 602.3502 616.7050 625.6773 634.6840 652.0120 672.6041 682.7792 702.3346 724.2994 731.7582 736.7256 741.5989 766.0855 788.6049 799.8096 809.4258 816.3249 832.3374 841.1558 856.5917 866.2421 869.6684 912.7578 922.0622 927.3346 934.2552 964.8021 977.1830 979.7521 983.3622 989.2986 989.9912 996.4961 1003.3939 1009.9792 1015.6548 1021.0183 1028.0260 1031.7715 1038.5699 1051.8620 1076.4183 1085.1729 1105.8149 1128.6918 1159.7078 1172.4963 1172.7968 1178.1669 1184.9965 1186.3112 1205.4997 1213.0769 1221.6591 1222.2645 1228.4267 1243.2768 1260.1693 1280.3302 1284.8439 1299.7764 1307.8158 1314.3090 1328.6738 1340.5065 1356.1352 1382.7534 1384.4182 1391.5791 1395.3419 1417.9173 1439.0701 1439.9963 1466.8285 1470.3252 1470.5329 1485.4438 1486.7468 1488.0639 1502.5177 1536.1411 1572.4641 1582.2391 1583.6292 1596.2708 1611.7410 1617.2260 1619.1149 1624.9061 2929.2698 2932.3751 2968.4887 2978.5085 2991.9357 3018.0469 3036.2394 3056.8767 3113.0870 3117.1112 3123.0573 3128.0529 3139.3701 3141.7109 3153.1590 3158.8754 3159.8669 3164.2664 3167.3774 3172.4212 3181.6611 3555.1298
redmass: 6.5711 5.7677 4.4039 3.7075 6.3245 5.4250 10.4528 6.7157 4.3734 3.9278 2.0631 5.1299 4.8337 5.1785 5.5704 4.0348 4.8329 3.6058 4.4570 4.2050 3.1109 4.7031 3.1260 6.2826 10.1415 5.0012 7.0755 2.8442 2.7316 2.3219 3.5857 3.4671 4.2016 3.1701 3.5085 3.2379 4.5916 3.2990 4.5663 5.3265 6.3883 6.5492 6.7546 5.5296 4.2173 4.8275 2.2150 3.5751 3.4226 1.3261 1.4607 4.4360 1.4491 1.9031 2.3280 1.9307 2.4164 2.3390 1.2513 3.0059 2.0957 1.3289 3.6641 2.1739 1.3993 1.3574 4.5975 1.4075 6.8468 1.4015 6.1049 1.3452 2.6973 1.3689 1.7362 4.7469 2.1424 2.4903 2.6796 1.9352 2.6597 1.5750 1.4910 1.3432 1.8630 1.0536 1.1408 1.2611 1.4240 1.1106 1.2440 1.8209 2.6395 2.5094 3.2077 1.3162 1.4065 1.6684 1.2105 2.1682 1.3292 1.3881 1.7144 1.4666 1.6790 4.0661 3.2638 3.6343 10.0746 3.3523 2.4306 2.1410 1.1043 1.1598 1.1433 1.8320 2.3074 1.3833 2.4172 9.3594 8.9174 7.3742 6.9235 6.2009 8.3518 7.9624 6.0743 6.5061 1.0694 1.0576 1.0595 1.0639 1.1026 1.0976 1.0911 1.1014 1.0876 1.0894 1.0895 1.0868 1.0864 1.0928 1.0911 1.0974 1.0936 1.0952 1.0971 1.0978 1.0970 1.0648
irintensity: 2.7960 0.0813 0.0747 0.5211 0.2002 1.0854 0.0446 0.4325 0.1782 2.9263 0.2519 1.1409 1.1584 0.2198 0.4487 5.8758 1.6218 1.7282 1.6633 2.5481 1.3224 1.7982 2.1078 12.3071 4.4440 1.8348 3.5398 1.0771 15.5804 40.0837 33.0135 7.0980 15.7014 21.6771 7.8977 11.1255 2.8222 20.8950 6.0489 4.7630 0.5337 2.5920 0.4879 4.0894 9.0103 29.3114 30.1215 0.9241 4.6291 1.3928 77.1030 13.7276 65.7191 2.1260 17.8306 9.3078 27.4360 26.6065 0.3114 2.8774 3.0581 4.1168 41.1796 10.0270 0.0160 0.1345 20.2229 1.9265 91.3723 4.5234 0.2323 0.5922 10.2559 0.0208 2.7599 6.6940 9.0511 1.0610 12.9313 4.2588 9.4825 8.2681 5.6541 31.0383 50.5973 0.4548 27.2427 94.8677 73.6332 7.0649 2.0217 88.9043 52.3095 28.2272 195.9444 9.2797 32.0366 9.7413 5.4897 48.7318 1.8396 17.1096 20.3701 2.6632 12.6374 9.6455 47.3665 18.7186 3.1579 3.0316 9.2868 15.3061 5.4045 43.6964 24.7018 17.0486 3.0833 42.2595 158.6364 264.7282 18.0011 66.4838 16.4278 0.8189 48.3883 8.8246 9.3390 50.8390 35.2385 27.8424 21.0840 41.2981 31.8561 6.7641 8.1511 22.4612 10.2534 19.8927 20.6195 0.8946 3.4903 29.0765 5.6633 35.4098 17.5235 4.5716 17.2280 8.7107 8.3028 43.5091
temp: 298.150 k
press: 1.00000 atm
elementType: 8 8 8 8 6 6 6 6 6 6 6 6 6 6 6 6 6 6 6 6 6 6 6 6 6 6 6 6 6 6 1 1 1 1 1 1 1 1 1 1 1 1 1 1 1 1 1 1 1 1 1 1
symmnumber: 1
zpe: 1070778.0 jmol-1
zpe.correction: 0.407838 hartree
zpe.thermalcorrener: 0.434117 hartree
zpe.thermalcorrenthalpy: 0.435061 hartree
zpe.thermalcorrgfe: 0.344649 hartree
zpe.sumelectzpe: -1302.745931 hartree
zpe.sumelectthermal: -1302.719652 hartree
zpe.sumelectthermalent: -1302.718708 hartree
zpe.sumelectthermalfe: -1302.809120 hartree
dipole: 1.1103 3.5007 -6.4440
dipole: 7.4170
quadrupole: -161.8801 -174.2161 -172.0621
quadrupole: -16.7067 16.5401 9.4790
quadrupole: 7.5060 -4.8300 -2.6760 -16.7067 16.5401 9.4790
hfenergy: -1303.1537687 hartree
pointgroup: C01 [X(C26H22O4)]
dipole: 0.4226356 -1.5071552 2.4627357 debye
polarizability: 395.7771047|16.924573|244.5598581|12.636329|-24.9332868|278.1152942 unknown
InChI: InChI=1S/C26H22O4/c27-24-21-10-4-5-11-22(21)25(28)26(29)23(24)12-6-9-18-13-15-20(16-14-18)30-17-19-7-2-1-3-8-19/h1-5,7-8,10-11,13-16,27H,6,9,12,17H2
charge 0 multiplicity 1
52 atoms
O  -3.842438 -0.46322 2.265998
O  -4.102691 2.26073 -1.712031
O  4.97251 0.382564 -0.257958
O  -6.124275 0.575197 -2.688128
C  -1.400372 1.374231 0.53242
C  -2.832512 1.902491 0.832945
C  -0.301153 2.347716 1.036937
C  -3.922513 0.985266 0.312226
C  -4.36439 -0.1232 1.01881
C  1.104587 1.847285 0.739655
C  -5.405129 -1.050985 0.547547
C  -4.49192 1.275416 -1.010703
C  -6.017171 -0.823556 -0.721585
C  -5.6045 0.338076 -1.563406
C  1.913465 1.272965 1.747585
C  1.634826 1.913649 -0.578768
C  -5.809142 -2.160712 1.328676
C  -7.020509 -1.705026 -1.188375
C  3.206682 0.770465 1.469563
C  2.916968 1.421088 -0.877519
C  3.707536 0.84262 0.14707
C  -6.812244 -3.033752 0.852559
C  -7.420466 -2.808709 -0.405694
C  5.821464 -0.251008 0.760831
C  7.093934 -0.746036 0.099086
C  7.12614 -1.087727 -1.274481
C  8.262831 -0.913361 0.882565
C  8.311353 -1.595435 -1.852917
C  9.445058 -1.428769 0.305959
C  9.472587 -1.77228 -1.065526
H  -1.240532 0.373728 0.983503
H  -1.296577 1.241661 -0.560633
H  -2.942012 2.095803 1.923917
H  -2.952229 2.881106 0.333626
H  -0.423403 2.500853 2.128054
H  -0.466542 3.333334 0.557557
H  1.534415 1.218622 2.775953
H  1.035656 2.363858 -1.379897
H  -5.335757 -2.32923 2.299149
H  -7.47003 -1.503628 -2.166258
H  3.801592 0.341487 2.281178
H  3.329052 1.476812 -1.889825
H  -7.119534 -3.889796 1.462648
H  -8.197486 -3.488516 -0.769988
H  -3.143482 0.183488 2.541593
H  5.264974 -1.099554 1.216046
H  6.057249 0.476775 1.564688
H  6.227728 -0.937675 -1.880147
H  8.253058 -0.637939 1.945125
H  8.328568 -1.852232 -2.918173
H  10.342807 -1.553113 0.921832
H  10.39007 -2.167229 -1.515986
