program: Gaussian 09
title: 000270723
version: EM64L-G09RevD.01
frameworkgroup: C1[X(C26H28O3)]
method: RPBEPBE
basis: SDD
operation: Freq
keyword: #pfreq=noraman
keyword: PBEPBE/SDD
title: #p freq=noraman PBEPBE/SDD
converged: YES YES NO NO
title: Mulliken charges:
elementType: O O O C C C C C C C C C C C C C C C C C C C C C C C C C C H H H H H H H H H H H H H H H H H H H H H H H H H H H H
charge: -0.396101 -0.157733 -0.137471 -0.223357 -0.404629 -0.446554 -0.413626 -0.373924 -0.410658 -0.386665 0.528149 -0.482198 -0.389447 0.503980 -0.397385 -0.466018 -0.557875 -0.389590 -0.586517 0.235277 0.002293 -0.161152 0.340890 0.291672 -0.207680 -0.381227 -0.374062 -0.221530 -0.232589 0.192652 0.208182 0.186411 0.201958 0.215699 0.194309 0.201440 0.193288 0.192851 0.200211 0.199184 0.191711 0.197606 0.232233 0.225563 0.234952 0.225102 0.200565 0.218506 0.253207 0.218781 0.279570 0.193502 0.287184 0.291559 0.239692 0.242424 0.377382
chargesum: 0.00000
title: Mulliken charges with hydrogens summed into heavy atoms:
elementType: O O O C C C C C C C C C C C C C C C C C C C C C C C C C C
charge: -0.018719 -0.157733 -0.137471 -0.030705 -0.010036 -0.028897 -0.017878 0.012216 -0.011263 0.002652 0.528149 -0.249965 -0.163883 0.503980 -0.162433 -0.240917 -0.138804 0.082397 -0.113444 0.235277 0.002293 -0.161152 0.340890 0.291672 -0.207680 -0.094043 -0.082503 0.018163 0.009836
polarizability: 3.78856862e+02 3.20063260e+01 2.73193804e+02 -1.38689574e+01 3.27689175e+01 2.48443297e+02
1716.lowfreq: -0.0004 0.0005 0.0011 1.0155 4.6816 10.9042 12.5632 14.9484 23.8433
frequency: 12.3018 14.5067 23.5372 33.3956 39.7510 45.3950 53.9500 66.4746 76.6464 99.2393 126.5022 130.3177 139.0933 169.9773 182.3459 188.5227 230.5640 240.1972 250.9468 272.0361 293.8739 320.4035 331.5731 344.5513 350.1424 352.3129 363.2819 400.1673 405.5182 407.2562 412.5635 421.9432 433.3627 458.9328 461.1197 487.3842 496.1228 512.0113 550.2269 567.3147 595.1620 626.5953 637.9551 652.2528 673.3382 682.4583 716.4167 731.4993 736.6647 742.8758 753.6653 785.7815 789.1537 799.9882 823.6918 826.1417 837.7075 849.6355 853.4728 866.2163 871.0604 874.4898 922.2425 928.0125 936.3577 949.5126 954.3166 971.2050 978.4137 989.9804 1010.4849 1012.2767 1015.3938 1020.0099 1021.5780 1026.9719 1032.8883 1039.1111 1052.7637 1063.9273 1076.4659 1103.5493 1119.7778 1130.1868 1144.7452 1160.2456 1172.2943 1172.5928 1184.1878 1184.5012 1189.8351 1195.7167 1216.0417 1219.8255 1222.2377 1244.0187 1245.4740 1262.1258 1265.6184 1277.8617 1281.1634 1283.3134 1288.6362 1301.2659 1312.1951 1319.7994 1327.7787 1332.5654 1335.3019 1339.0686 1343.1355 1354.8748 1358.6365 1359.4074 1382.1816 1383.8933 1395.0614 1413.7716 1439.2031 1460.2555 1461.8146 1466.1820 1466.2712 1469.5128 1471.9349 1478.3382 1484.6770 1488.4396 1489.5008 1505.0689 1535.7296 1571.9917 1580.9399 1581.9835 1611.4108 1616.7448 1622.8095 2932.8082 2952.4496 2958.2174 2961.0131 2964.8679 2967.2160 2969.1105 2973.6197 2977.1816 2980.7834 3003.8572 3016.3873 3019.0717 3022.0300 3023.7953 3030.8006 3035.5796 3038.5448 3058.7856 3105.8080 3107.6382 3128.8545 3135.5205 3139.3117 3152.9965 3167.2102 3180.8642 3552.5014
redmass: 6.3680 5.7959 3.5421 4.4565 4.4810 4.3682 11.9271 3.3292 4.4448 1.9761 4.4066 2.3588 4.1358 3.7931 5.0874 2.8700 4.3372 2.7632 4.5371 2.6588 2.2438 3.1664 3.3707 3.7962 3.2690 4.6265 7.8140 7.5161 2.8430 3.9084 3.9049 2.3589 3.4447 2.4553 3.0551 2.4788 2.9180 1.9452 2.9549 4.8672 3.7151 6.2475 6.7296 5.4109 4.2325 4.7874 1.6415 3.8218 1.2841 2.9007 2.0878 2.6885 1.4519 1.9748 1.7327 3.2128 1.6957 1.2734 2.6201 3.0023 2.0639 2.0992 3.8008 2.1324 2.1406 2.1487 1.4014 1.3816 4.4806 1.4009 1.3683 2.5233 2.2062 1.6794 3.4645 1.8702 2.3075 2.7865 1.9216 2.2400 2.6706 1.5604 2.0600 1.5666 2.2423 1.8391 1.2085 1.1466 1.6191 1.4137 1.2554 1.2825 2.1934 1.9549 2.6335 1.3136 1.2006 1.3938 1.4436 1.2589 1.6668 1.1747 1.1897 2.2657 1.2652 1.3260 1.6753 1.3429 1.3450 1.4212 1.4145 1.4744 1.3913 1.4464 2.9815 4.1017 10.0797 2.4556 2.4352 1.0852 1.0816 1.0909 1.0821 1.0887 1.1639 1.0871 1.8859 1.3574 1.0874 2.6540 8.9550 8.8909 6.4267 7.3661 8.2799 7.9320 6.4894 1.0688 1.0793 1.0586 1.0623 1.0632 1.0623 1.0592 1.0617 1.0664 1.0640 1.0986 1.0992 1.0977 1.1001 1.1006 1.0997 1.0906 1.1021 1.1020 1.0868 1.0869 1.0957 1.0967 1.0864 1.0911 1.0969 1.0973 1.0648
irintensity: 2.1655 0.8103 0.1850 0.5787 0.1717 0.0541 0.0270 0.1183 0.7087 0.3469 1.6148 0.0076 0.1139 0.6398 0.8341 0.3659 1.0973 0.5082 2.0870 1.1531 0.3968 1.3568 1.7948 5.6633 3.8609 2.9565 3.5509 3.3668 0.1584 1.4528 2.9450 61.7704 3.1988 4.4971 10.5765 34.3413 13.4746 1.2269 20.9978 2.4520 11.1619 5.1506 0.0534 4.9975 6.5449 24.7311 3.6014 5.5167 0.5223 2.5577 2.3646 17.4890 62.1662 1.1840 25.7516 1.2936 12.3844 1.0783 3.4014 2.6644 1.1168 4.1922 39.5455 8.1830 9.3149 4.0497 0.7949 0.0100 19.5395 4.4504 0.0428 4.6969 0.1742 2.7755 4.8511 1.3414 2.1027 10.8322 4.7321 0.8959 9.6779 5.9115 3.0948 21.3697 1.9189 52.2573 3.4909 33.4525 0.6955 69.0318 0.2885 1.0132 0.8046 1.7221 38.1647 14.2709 0.6734 26.2926 1.3939 1.3404 9.6846 1.8735 5.6680 51.8811 0.2131 1.1412 23.2085 0.2441 0.5186 1.2323 1.2465 1.1717 0.2967 1.2380 38.6026 10.9147 3.0938 4.3348 9.3316 5.6242 5.3526 0.2929 6.8854 6.2780 1.7857 14.8540 18.1089 42.7984 14.7260 43.7212 260.5356 18.8373 0.7371 67.4616 50.8134 7.4983 0.3361 37.1558 4.7748 16.7801 23.0589 43.5234 38.8781 24.3861 52.2766 32.6136 35.2264 15.5839 83.6582 7.8905 34.8619 62.6260 27.9557 6.2629 131.3051 22.9801 7.3804 33.1800 41.5601 1.3098 3.5518 5.5613 16.9064 8.9995 43.1117
temp: 298.150 k
press: 1.00000 atm
elementType: 8 8 8 6 6 6 6 6 6 6 6 6 6 6 6 6 6 6 6 6 6 6 6 6 6 6 6 6 6 1 1 1 1 1 1 1 1 1 1 1 1 1 1 1 1 1 1 1 1 1 1 1 1 1 1 1 1
symmnumber: 1
zpe: 1242180.8 jmol-1
zpe.correction: 0.473122 hartree
zpe.thermalcorrener: 0.499512 hartree
zpe.thermalcorrenthalpy: 0.500456 hartree
zpe.thermalcorrgfe: 0.412626 hartree
zpe.sumelectzpe: -1231.131909 hartree
zpe.sumelectthermal: -1231.105519 hartree
zpe.sumelectthermalent: -1231.104575 hartree
zpe.sumelectthermalfe: -1231.192405 hartree
dipole: -1.0447 4.3351 4.3113
dipole: 6.2026
quadrupole: -158.2088 -175.6373 -171.1685
quadrupole: 24.3300 17.6446 -7.1489
quadrupole: 10.1294 -7.2991 -2.8303 24.3300 17.6446 -7.1489
hfenergy: -1231.6050308 hartree
pointgroup: C01 [X(C26H28O3)]
dipole: 0.3660949 -1.7534496 1.6572316 debye
polarizability: 380.2148577|29.2835422|273.2692776|14.1676437|-32.4250737|247.0098268 unknown
InChI: InChI=1S/C26H28O3/c27-24-21-11-5-6-12-22(21)25(28)26(29)23(24)13-7-8-18-14-16-20(17-15-18)19-9-3-1-2-4-10-19/h5-6,11-12,14-17,19,27H,1-4,7-10,13H2
charge 0 multiplicity 1
57 atoms
O  -3.47264 -0.821806 2.198168
O  -3.415546 2.64459 -1.163163
O  -5.612871 1.419353 -2.409585
C  5.587651 -0.130546 -0.601402
C  5.688123 -1.686507 -0.55037
C  6.735839 0.609293 0.149284
C  6.857442 -2.260436 -1.392342
C  8.183574 0.214351 -0.237881
C  8.225825 -2.375764 -0.668129
C  8.599481 -1.192505 0.265432
C  4.234009 0.368041 -0.088798
C  3.41041 1.198113 -0.891708
C  3.771243 0.040521 1.212449
C  1.711733 1.354314 0.884016
C  2.173077 1.683724 -0.416084
C  2.532737 0.523429 1.687955
C  0.364134 1.857821 1.38104
C  -0.831032 1.106197 0.735946
C  -2.198875 1.658861 1.229265
C  -3.384697 0.983932 0.567491
C  -3.951513 -0.184566 1.054661
C  -3.916149 1.590287 -0.660564
C  -5.096494 -0.87435 0.43757
C  -5.676575 -0.333826 -0.749317
C  -5.127778 0.912057 -1.361173
C  -5.632864 -2.058155 0.999756
C  -6.779621 -0.981909 -1.353105
C  -6.73546 -2.695647 0.388841
C  -7.311634 -2.160055 -0.787988
H  5.661559 0.151733 -1.673805
H  4.734242 -2.094105 -0.938892
H  5.766088 -2.033199 0.500332
H  6.61222 0.445821 1.240051
H  6.595587 1.696827 -0.014518
H  6.970534 -1.63025 -2.297881
H  6.581664 -3.268218 -1.761797
H  8.864353 0.966671 0.208273
H  8.32273 0.287247 -1.336213
H  9.012293 -2.493237 -1.441016
H  8.24397 -3.308586 -0.068845
H  8.138834 -1.346423 1.262741
H  9.694724 -1.22016 0.433065
H  3.746887 1.468561 -1.900717
H  4.383071 -0.597559 1.861907
H  1.561293 2.330449 -1.058205
H  2.200598 0.259184 2.700396
H  0.307771 1.756192 2.483459
H  0.254437 2.937305 1.154514
H  -0.782215 1.219887 -0.362892
H  -0.741756 0.02085 0.943533
H  -2.243846 2.734741 0.979603
H  -2.251678 1.597439 2.339633
H  -5.183379 -2.467159 1.908051
H  -7.201575 -0.54227 -2.262806
H  -7.145085 -3.610272 0.830547
H  -8.16608 -2.65818 -1.257468
H  -2.704677 -0.325403 2.581285
