program: Gaussian 09
title: 000276282
version: EM64L-G09RevD.01
frameworkgroup: C1[X(C9H10N2O)]
method: RPBEPBE
basis: SDD
operation: Freq
keyword: #p
keyword: freq=noraman
keyword: PBEPBE/SDD
title: #p freq=noraman PBEPBE/SDD
converged: NO NO NO NO
title: Mulliken charges:
elementType: O N N C C C C C C C C C H H H H H H H H H H
charge: -0.277630 -0.702019 -0.012995 0.344491 -0.258821 -0.320604 -0.359686 0.498721 -0.419645 -0.390269 -0.453056 -0.149229 0.220470 0.220533 0.240638 0.244561 0.215864 0.218586 0.266870 0.266940 0.303283 0.302997
chargesum: 0.00000
title: Mulliken charges with hydrogens summed into heavy atoms:
elementType: O N N C C C C C C C C C
charge: -0.277630 -0.095739 -0.012995 0.344491 0.182182 -0.079965 -0.115125 0.498721 -0.203781 -0.171683 0.080753 -0.149229
polarizability: 1.76055769e+02 -4.38704331e+00 1.07096324e+02 -5.94345649e-02 9.89772714e-03 5.49233550e+01
1716.lowfreq: -9.5537 -0.0003 0.0005 0.0007 6.8400 13.7897 32.1855 68.2836 77.7583
frequency: 31.9501 68.2563 77.7412 124.5630 156.6600 184.9414 264.5904 304.7838 331.7664 335.9614 352.5211 371.7275 413.6830 418.5888 510.7433 515.1665 547.3627 637.1321 710.7866 744.0907 790.7822 812.2264 818.8365 827.0829 910.7138 940.3686 949.0139 992.1539 1004.9167 1016.9452 1062.1153 1069.6468 1127.9957 1178.3670 1182.0965 1209.5889 1272.9176 1288.5518 1306.8349 1314.9981 1373.9120 1392.9288 1439.4734 1449.6704 1489.2832 1513.1099 1589.1793 1633.9549 1648.4518 2208.9565 2960.7741 3014.0102 3019.6406 3075.3641 3123.3952 3126.1744 3157.1025 3164.9797 3576.2353 3716.2990
redmass: 5.5775 7.3621 3.2814 2.2283 5.5331 5.9510 5.6134 1.1885 1.0579 3.7297 6.9492 3.6236 2.7804 3.8338 2.2586 8.6320 5.1531 6.6799 3.2985 6.2767 1.2938 1.2333 1.6226 5.8395 1.3897 1.3463 4.4788 3.5222 4.0191 1.4636 1.5685 3.4827 1.1958 1.2445 1.1408 2.7175 1.1077 1.3645 1.6479 2.2047 1.9228 2.6671 3.5114 1.0791 1.1497 2.5616 7.2579 1.5314 2.7222 12.4398 1.0552 1.0586 1.1078 1.1024 1.0890 1.0886 1.0945 1.0954 1.0448 1.1041
irintensity: 0.2537 2.2829 11.3956 5.4960 0.0650 7.1143 1.7173 322.8836 9.2600 1.9592 2.3310 1.0373 0.0054 1.5259 23.8235 0.2385 9.7025 0.3290 0.5565 37.4126 19.0113 17.8674 68.1273 0.1808 0.1736 0.1987 13.3404 7.3007 75.7499 1.2364 0.3109 4.5924 21.1389 28.7300 0.8633 291.4376 0.1521 5.4660 3.2245 14.3442 19.6829 33.4161 3.9542 11.8000 75.4338 280.1181 1.1336 48.1628 130.3668 13.3200 34.0643 4.8962 31.8873 9.3099 14.9392 34.3745 16.5468 4.5469 68.6938 20.1142
temp: 298.150 k
press: 1.00000 atm
elementType: 8 7 7 6 6 6 6 6 6 6 6 6 1 1 1 1 1 1 1 1 1 1
symmnumber: 1
zpe: 453696.1 jmol-1
zpe.correction: 0.172804 hartree
zpe.thermalcorrener: 0.184656 hartree
zpe.thermalcorrenthalpy: 0.185601 hartree
zpe.thermalcorrgfe: 0.134128 hartree
zpe.sumelectzpe: -532.783905 hartree
zpe.sumelectthermal: -532.772052 hartree
zpe.sumelectthermalent: -532.771108 hartree
zpe.sumelectthermalfe: -532.822581 hartree
dipole: -5.2995 0.4367 0.0149
dipole: 5.3175
quadrupole: -76.3092 -65.3748 -74.2298
quadrupole: 11.5674 -0.0068 -0.0034
quadrupole: -4.3379 6.5965 -2.2585 11.5674 -0.0068 -0.0034
hfenergy: -532.9567084 hartree
pointgroup: C01 [X(C9H10N2O1)]
dipole: -2.0336568 -0.417452 0.2582963 debye
dipolederiv: -2.0070017 -0.2420404 0.095346 -0.1897556 -0.3178683 0.0271123 0.0364214 0.0215244 -0.2985751 -1.6363212 0.0073241 -0.1024187 0.0531895 -0.4730746 -0.3390364 -0.1535508 -0.3442706 -0.3842354 -0.3224896 -0.0133802 0.0065678 -0.0764379 -0.2448818 0.0051336 0.0794564 0.0116359 -0.2391281 1.4915648 0.1069087 0.0323928 -0.082223 -0.0662782 0.1099262 0.2523129 0.1304151 -0.0904621 0.9347601 0.1699609 -0.1421409 0.3615987 0.4204839 0.0331518 -0.3681378 0.0122835 0.3613584 -0.0851353 -0.143484 0.1791406 0.1489476 -0.0677862 -0.1090267 -0.163027 -0.140793 -0.0274754 -0.111422 0.1233522 -0.1408005 -0.1011514 -0.0323756 -0.1448614 0.1231323 -0.1202212 0.0080384 1.6589071 0.0004645 0.1675789 -0.0058536 0.0022819 0.1502849 0.1755454 0.1509226 -0.0255068 -0.3223206 0.1310972 -0.1642284 -0.247044 -0.0883399 -0.1925189 0.2780057 -0.1505992 -0.0216454 -0.2253087 -0.0944688 0.1108349 0.2504301 -0.0766799 -0.1507607 -0.2932288 -0.1885109 -0.0392737 -0.0547478 -0.0664039 0.0490313 -0.0852303 0.1459505 0.0622031 0.0717744 0.064435 0.1397111 0.0631479 0.0954266 -0.0990297 0.1752703 0.0232156 -0.0700375 -0.1919477 -0.0786398 0.0185369 -0.0104299 -0.011509 -0.0370833 -0.0599196 0.0259306 -0.0433688 0.0805194 -0.0196863 -0.1533346 -0.0156039 0.0543135 0.0007146 -0.0556499 -0.1605678 0.0039181 0.0684766 -0.002571 0.0379562 0.0244616 -0.0726482 0.0696775 -0.0924176 0.0771983 0.0909643 0.0930059 0.0929838 0.064731 0.075417 0.0467987 -0.064834 0.0454687 0.0867533 0.098176 -0.0632053 0.0981104 0.0440551 -0.0016107 0.0512682 -0.07887 0.0523414 0.0691329 0.1218746 -0.0804909 0.1216538 0.0162949 -0.0388313 -0.0889813 0.0819567 -0.0769786 0.0692879 0.106188 0.0676668 0.1048787 0.0509928 0.0809019 0.009782 0.0331871 0.0416179 -0.0338024 0.0029083 0.0179835 -0.0159336 0.1060971 0.0899879 -0.0337687 0.0101085 -0.0221191 0.0948229 -0.0383579 -0.0256318 -0.0242852 -0.0311349 0.2018364 -0.0230889 0.0054465 -0.035643 0.2716391 0.1376794 0.020394 0.1393643 0.2321139 0.210238 -0.0069234 -0.0125776 0.0015593 0.2749576 0.1384478 -0.0254745 0.1373034 0.2308858 unknown
polarizability: 172.8143793|15.4250552|79.3429866|-5.1218961|-26.9254757|85.9180815 unknown
InChI: InChI=1S/C9H10N2O/c10-6-1-7-12-9-4-2-8(11)3-5-9/h2-5H,1,7,11H2
charge 0 multiplicity 1
22 atoms
O  1.092634 -0.154008 0.544913
N  -4.516786 -0.006499 -0.242217
N  5.271554 1.66158 -1.122915
C  -0.299474 -0.05843 0.282711
C  1.983928 0.643548 -0.2927
C  -0.875485 0.747736 -0.725701
C  -1.131379 -0.843752 1.113988
C  -3.127816 -0.021216 -0.071746
C  -2.277527 0.762915 -0.898473
C  -2.526283 -0.826694 0.941152
C  3.4018 0.328374 0.226373
C  4.438117 1.062106 -0.516673
H  1.884852 0.356798 -1.35948
H  1.760713 1.725019 -0.189759
H  -0.257571 1.367139 -1.382994
H  -0.669747 -1.462073 1.890096
H  -2.713896 1.39143 -1.684216
H  -3.158238 -1.441051 1.593831
H  3.585403 -0.758631 0.143553
H  3.460858 0.587707 1.299458
H  -4.947604 0.566608 -0.960317
H  -5.119154 -0.571606 0.347313
