program: Gaussian 09
title: 000276275
version: EM64L-G09RevD.01
frameworkgroup: C1[X(C8H17N)]
method: RPBEPBE
basis: SDD
operation: Freq
keyword: #pfreq=noraman
keyword: PBEPBE/SDD
title: #p freq=noraman PBEPBE/SDD
converged: YES YES NO NO
title: Mulliken charges:
elementType: N C C C C C C C C H H H H H H H H H H H H H H H H H
charge: -0.320199 -0.040710 -0.440113 -0.418298 -0.396933 -0.413361 -0.421171 -0.351458 -0.639133 0.191895 0.197045 0.201006 0.212928 0.181845 0.201871 0.198316 0.195169 0.200799 0.203182 0.187993 0.188835 0.189803 0.256500 0.219447 0.192045 0.222698
chargesum: 0.00000
title: Mulliken charges with hydrogens summed into heavy atoms:
elementType: N C C C C C C C C
charge: -0.063699 0.151185 -0.042062 -0.023525 0.003254 -0.017394 -0.029997 0.027179 -0.004942
polarizability: 9.80014328e+01 -1.36864550e+00 8.88689910e+01 -4.72499698e-01 -8.55625919e-01 8.24443708e+01
1716.lowfreq: -20.0216 0.0003 0.0006 0.0009 14.0115 39.9759 97.6844 119.2745 154.3861
frequency: 97.1408 119.1114 154.3095 160.1898 214.0567 254.4239 279.6245 313.9199 372.2184 396.4645 445.0451 528.6348 599.8435 651.3216 719.6604 729.4786 797.5873 826.7428 856.4026 899.3159 925.8908 942.6449 1000.9264 1016.1336 1028.1245 1069.1362 1098.6421 1109.3595 1132.7796 1153.9366 1159.0659 1195.7673 1202.4184 1207.2507 1227.0672 1269.1687 1282.1949 1307.6821 1319.0988 1335.6105 1337.7828 1346.4739 1358.5220 1362.3674 1366.6402 1431.7267 1443.9196 1450.0199 1458.4362 1464.6308 1470.8080 1472.7886 1479.2597 1485.4147 1496.9057 2872.9506 2948.5570 2950.9318 2958.1087 2962.8044 2966.7936 2972.4783 2980.6037 3000.4141 3005.7754 3011.6175 3018.6783 3022.2451 3032.1287 3039.2879 3065.9356 3457.7634
redmass: 2.5277 2.2581 1.7713 2.0261 1.4250 2.0058 2.2170 2.9770 2.1181 2.0662 2.1520 2.0528 1.4314 2.3386 1.8794 1.7016 2.0663 2.8248 1.6618 1.6850 1.9822 2.1047 1.6483 1.8509 2.0630 1.7039 1.2007 1.7965 1.9856 2.0568 2.6013 1.1197 1.3583 1.5335 1.4498 1.2048 1.1545 1.3210 1.4566 1.3371 1.4856 1.4520 1.3633 1.3843 1.3993 1.1248 1.2011 1.0849 1.0885 1.0762 1.0817 1.0890 1.0834 1.0858 1.0449 1.0559 1.0759 1.0624 1.0607 1.0639 1.0619 1.0662 1.0688 1.0970 1.0747 1.0978 1.0973 1.0999 1.1012 1.1008 1.0996 1.0740
irintensity: 1.3503 0.8008 0.4148 0.3109 2.1825 4.0890 0.0401 4.0917 2.3595 0.7534 0.6815 0.3224 107.3599 12.4724 7.7378 7.5697 10.7792 2.5631 7.7257 5.5238 1.6748 1.2138 7.3992 1.1154 0.3117 5.9792 1.1543 7.2187 18.7138 12.2748 3.2716 1.8492 9.2038 0.2966 4.4406 2.7187 2.5874 2.1497 0.3522 0.1251 0.9106 0.6757 0.1175 0.3034 1.3611 1.5494 30.5492 5.5605 9.1703 0.9198 4.6476 8.4939 24.8348 12.7480 11.6419 116.7650 12.1006 23.9858 24.0182 26.2143 23.2692 65.0852 66.8323 32.0538 68.3476 111.9622 14.8196 59.1198 35.4361 131.1336 37.2537 0.9231
temp: 298.150 k
press: 1.00000 atm
elementType: 7 6 6 6 6 6 6 6 6 1 1 1 1 1 1 1 1 1 1 1 1 1 1 1 1 1
symmnumber: 1
zpe: 628584.7 jmol-1
zpe.correction: 0.239415 hartree
zpe.thermalcorrener: 0.249268 hartree
zpe.thermalcorrenthalpy: 0.250212 hartree
zpe.thermalcorrgfe: 0.205161 hartree
zpe.sumelectzpe: -369.021797 hartree
zpe.sumelectthermal: -369.011945 hartree
zpe.sumelectthermalent: -369.011000 hartree
zpe.sumelectthermalfe: -369.056051 hartree
dipole: 0.3902 1.0287 0.2052
dipole: 1.1192
quadrupole: -57.4970 -60.2865 -57.0899
quadrupole: -1.9814 -0.4791 -1.6302
quadrupole: 0.7941 -1.9954 1.2013 -1.9814 -0.4791 -1.6302
hfenergy: -369.2612123 hartree
pointgroup: C01 [X(C8H17N1)]
dipole: 0.1630222 -0.4006961 -0.0822448 debye
dipolederiv: -0.5819785 -0.1048854 0.1898449 -0.0775112 -0.6137924 -0.1835623 0.2268627 -0.1637247 -0.4241497 0.3067213 -0.0535557 -0.1252135 -0.0241508 0.347344 -0.008304 -0.2786138 0.0296942 0.4189821 0.031438 0.0285129 0.0178148 0.0594812 -0.0556305 -0.0666024 0.0649316 -0.0315981 -0.0072602 0.0334021 -0.0071186 0.005509 -0.0117418 0.0515027 -0.0162644 0.0158331 -0.0119637 0.117856 0.0943925 0.0042085 -0.0377228 -0.0040496 0.0655732 0.0188766 -0.0509554 0.0308792 0.077745 0.0776555 -0.0042419 -0.0346407 -0.0006383 0.0720954 0.0206169 -0.0265918 0.0056937 0.1196787 0.0969683 -0.0332576 -0.0365101 -0.0322121 0.0597296 0.0197699 -0.0443426 0.029024 0.1055665 0.0876138 0.0004241 0.0018262 0.0073392 0.0301923 0.0106972 -0.0015656 0.0105899 0.1103129 0.4750822 0.114961 -0.0472289 0.0632278 0.3603796 0.047777 0.0331777 0.0582819 0.1355337 -0.1195779 0.0869491 -0.1197089 0.0631271 -0.0165524 0.0448168 -0.0787741 0.0486337 -0.0722612 -0.0388754 -0.0049199 0.1585296 0.0120246 0.032757 0.0654462 0.1171358 0.0534209 -0.0887091 -0.1074313 -0.0943626 -0.1391737 -0.0751316 -0.0400269 -0.05018 -0.1008219 -0.0381134 0.0205087 0.0069375 0.1033801 -0.0143513 0.0815454 -0.1615741 -0.0364698 -0.0117142 -0.0761896 0.0577043 -0.0268828 -0.0446083 0.0851878 -0.0218024 0.0719622 -0.0047118 0.063915 0.0532626 -0.1738032 0.0007977 0.1114657 0.0433528 0.0637969 -0.0912014 -0.0982487 0.0240169 -0.1213927 -0.0295064 -0.0815351 -0.1373156 0.0610581 -0.090086 0.0056055 0.0581985 0.0623754 0.0836827 -0.0303654 0.0349743 0.0506375 0.0840263 0.0270125 0.0506938 0.0350854 0.0546676 -0.0152053 -0.1748906 -0.0917562 -0.1422667 -0.017145 -0.1241851 -0.1318356 0.004889 0.0072839 0.0248239 0.0749183 -0.073147 0.1216036 -0.0824522 0.1188599 -0.1300915 0.0622587 -0.0350104 0.0397695 0.0503604 -0.0134159 -0.0098618 0.1159029 0.000201 0.035871 -0.099111 0.0939246 -0.0579347 -0.1404951 -0.1810994 -0.0056803 -0.1121269 -0.0068233 0.0145421 0.000578 -0.1551988 0.0022672 0.0055506 0.0754611 0.0061095 0.047629 0.0064576 0.0155064 -0.0148506 0.1109296 -0.024293 -0.1636517 0.0636706 0.0009071 -0.0935516 0.0288805 0.22718 0.1751185 -0.0504731 0.1034664 0.1063052 0.0021113 -0.0183204 0.0978528 -0.0328698 0.0807788 -0.0128252 0.1688691 0.008704 -0.1361731 -0.0264764 -0.0077337 0.0199068 -0.1150729 -0.2911391 -0.0548656 -0.037515 -0.1086147 0.0458846 -0.0450504 0.0389697 -0.0686157 0.084321 0.0101303 0.0818672 -0.1723464 0.0668361 -0.0056412 unknown
polarizability: 97.9333144|1.5978253|88.9444033|0.2633192|-0.8810203|82.4370769 unknown
InChI: InChI=1S/C8H17N/c1-9-8-6-4-2-3-5-7-8/h8-9H,2-7H2,1H3
charge 0 multiplicity 1
26 atoms
N  -1.548184 0.470348 0.676164
C  -0.847059 0.578191 -0.627254
C  -0.376503 -0.777297 -1.252232
C  0.297064 1.623735 -0.552541
C  0.308207 -1.795239 -0.300888
C  1.469625 1.324778 0.413168
C  1.393886 -1.253667 0.675813
C  2.204793 -0.023033 0.195917
C  -2.830777 -0.256493 0.658285
H  -1.594119 1.00251 -1.332366
H  0.304412 -0.538614 -2.093914
H  -1.249662 -1.288173 -1.707369
H  -0.15462 2.592797 -0.264822
H  0.70558 1.744792 -1.577066
H  0.76193 -2.578475 -0.94059
H  -0.467971 -2.311353 0.299358
H  1.109057 1.362748 1.462605
H  2.199591 2.153748 0.316167
H  2.091521 -2.084642 0.902042
H  0.929591 -0.986486 1.648371
H  3.15652 0.009077 0.763652
H  2.482666 -0.137096 -0.872005
H  -0.922724 0.140543 1.422044
H  -3.28507 -0.226811 1.665349
H  -2.769772 -1.327072 0.343237
H  -3.527579 0.251683 -0.034824
