program: Gaussian 09
title: 000270710
version: EM64L-G09RevD.01
frameworkgroup: C1[X(C22H20Cl2N8O2)]
method: RPBEPBE
basis: SDD
operation: Freq
keyword: #p
keyword: freq=noraman
keyword: PBEPBE/SDD
title: #p freq=noraman PBEPBE/SDD
converged: YES YES NO NO
title: Mulliken charges:
elementType: Cl Cl O O N N N N N N N N C C C C C C C C C C C C C C C C C C C C C C H H H H H H H H H H H H H H H H H H H H
charge: -0.045337 -0.045405 -0.212733 -0.214459 -0.179592 -0.041759 0.004315 -0.010068 -0.062184 -0.632238 -0.612555 0.024269 0.447589 -0.368938 -0.372165 0.336098 -0.362714 -0.376267 -0.417883 -0.444230 -0.022485 -0.590972 -0.589612 -0.139629 0.048086 -0.040567 0.112751 -0.134067 0.345802 -0.342736 -0.338388 -0.366457 -0.368361 0.385062 0.250536 0.243968 0.244769 0.252266 0.237731 0.239194 0.255937 0.277746 0.266270 0.292797 0.292017 0.265381 0.296881 0.283415 0.343858 0.338536 0.284065 0.282722 0.349242 0.330497
chargesum: 0.00000
title: Mulliken charges with hydrogens summed into heavy atoms:
elementType: Cl Cl O O N N N N N N N N C C C C C C C C C C C C C C C C C C C C C C
charge: -0.045337 -0.045405 -0.212733 -0.214459 -0.179592 -0.041759 0.004315 -0.010068 -0.062184 0.050156 0.067184 0.024269 0.447589 0.125566 0.124870 0.336098 -0.124983 -0.137073 -0.161946 -0.166484 -0.022485 -0.031905 -0.032214 -0.139629 0.048086 -0.040567 0.112751 -0.134067 0.345802 -0.045855 -0.054973 -0.082392 -0.085639 0.385062
polarizability: 8.59580526e+02 1.79098444e+01 3.37033210e+02 6.32230550e+00 -3.16924056e+01 1.66055006e+02
1716.lowfreq: -1.9589 -0.0020 -0.0019 -0.0010 3.2493 6.4922 11.9395 16.1799 21.3393
frequency: 11.7893 16.1161 21.3154 30.4473 33.9110 34.2788 48.5614 54.7132 66.9049 71.4754 75.8124 97.9189 109.0394 114.1243 122.3180 154.7792 168.0577 184.7087 197.6579 205.4161 212.1568 224.6517 233.5800 257.7629 262.4880 278.7486 297.3073 309.9134 319.3399 345.0155 385.2779 413.3546 414.6774 415.9613 432.3174 438.8798 461.4264 469.5534 479.4337 487.6249 497.1364 507.5909 528.2123 536.5322 546.9313 553.0740 575.1809 593.0764 614.1691 615.6878 626.6918 633.8088 638.5721 662.8339 672.3831 679.3318 684.0020 688.4305 694.6216 725.7804 744.7161 749.3500 760.1026 776.9319 778.7726 787.2227 791.7225 801.4941 821.2771 823.6166 834.4837 866.1919 882.3006 894.7200 946.7218 958.8625 971.9245 981.9233 996.7553 998.1422 1008.0830 1011.9322 1020.1037 1020.5527 1031.4539 1044.9081 1046.1613 1051.6747 1090.8893 1101.1569 1118.4783 1119.5679 1141.6845 1165.8003 1175.7468 1183.5992 1211.5255 1215.7591 1221.4759 1235.7218 1253.8513 1258.6668 1280.8451 1282.9819 1286.6676 1296.4829 1302.9500 1323.8817 1343.9348 1349.3515 1351.5812 1352.6276 1363.7975 1366.8928 1389.7820 1396.2013 1410.5556 1418.2156 1423.6660 1435.5288 1453.3762 1456.1414 1462.7910 1480.5137 1482.4801 1499.2542 1507.1448 1519.0058 1526.2327 1532.8036 1555.2194 1590.7049 1605.1451 1609.0586 1609.8721 1625.0987 3013.2634 3015.5593 3060.0617 3062.8454 3073.6673 3079.6339 3130.8856 3143.9794 3146.3169 3147.4160 3162.7880 3168.3842 3168.7079 3170.5188 3186.0743 3189.8203 3524.6615 3527.9325 3684.3002 3685.6019
redmass: 10.4421 7.8265 12.0006 11.0330 14.2486 6.6466 8.5300 7.0464 3.9598 5.0325 6.5759 4.3004 4.4999 4.6187 3.1882 7.7376 5.5254 6.9160 5.8160 6.1925 6.5934 5.3051 4.7807 3.7378 8.4235 6.3548 5.2266 7.3038 3.7620 4.8950 5.4259 2.9480 3.0435 3.8006 4.8064 6.1785 3.8949 3.6410 1.4009 2.9530 4.8960 6.4802 4.0962 3.1755 2.1095 2.1334 5.1612 1.4603 1.1852 3.6604 7.1659 5.8983 6.6706 5.9660 8.8856 8.5004 6.5046 5.5782 4.6636 4.2095 8.3290 4.1245 6.0826 1.8591 1.9183 7.8585 1.2607 5.6784 1.9157 2.6431 1.8596 1.2458 6.1472 1.6900 2.6276 1.4512 1.4374 3.7444 3.1491 1.4946 2.5093 1.3467 2.4585 1.3486 3.9864 1.8535 2.7707 2.3995 3.4440 1.3229 3.0931 1.7308 1.4701 1.4175 2.4507 1.5776 1.3078 7.6620 1.9544 2.9083 1.1561 1.1596 3.2200 1.4023 1.6545 1.2100 3.6437 1.4942 7.5418 1.5855 1.2467 5.9952 5.3808 6.0750 2.3738 3.0340 8.9610 5.6366 4.8767 3.5535 2.9154 1.3289 1.0923 2.9011 1.1013 1.0901 4.3423 3.3596 3.1581 4.3810 6.2053 8.3406 2.4677 1.5915 2.8464 5.8548 1.0610 1.0626 1.0567 1.0564 1.1029 1.1020 1.0887 1.1100 1.0928 1.1077 1.0936 1.0892 1.0958 1.0887 1.0958 1.0971 1.0442 1.0449 1.1046 1.1050
irintensity: 0.6944 0.1334 0.5975 0.4099 0.6913 0.0475 0.2005 0.1400 2.0777 0.2936 0.7185 1.2605 5.1084 1.6482 2.2102 0.2553 3.7063 1.4253 3.6744 5.2156 4.9292 7.8885 3.1734 1.6476 0.2370 4.5616 2.9132 2.1692 2.9370 7.7905 11.2211 0.0979 5.7875 2.4328 2.9199 1.8409 10.5302 16.3182 89.4247 68.5023 5.0697 1.0542 22.8117 7.6119 100.9936 106.5324 2.6150 77.7746 54.4485 14.2098 0.9077 0.8457 3.6201 1.8670 20.6941 35.1662 100.8101 79.7718 27.3228 1.1543 2.2813 3.5984 3.1874 8.5869 5.0963 43.0705 8.6659 18.5794 7.8058 7.8254 55.6613 0.5773 5.9982 58.1636 52.9820 5.2477 13.2402 8.4156 5.6370 5.8730 7.0543 0.0081 9.6705 0.0191 0.0552 1.4590 1.3702 14.0768 34.2951 20.9735 7.8956 31.3009 5.3612 13.9622 10.4265 128.2445 200.1644 791.4886 32.6494 23.2729 11.9851 16.3758 45.8260 74.6337 10.9875 6.4259 11.9195 16.8124 98.2516 165.1809 0.1109 138.3018 165.5267 46.6923 72.5143 15.7026 63.6915 98.5998 119.1880 22.6143 296.2805 54.6220 17.7601 20.5763 11.9152 33.1845 311.7461 239.8733 102.1190 21.3616 6.4777 0.9180 358.4031 43.8612 352.8842 630.3936 11.3562 51.6838 12.6847 25.6310 4.0147 17.3077 7.3505 5.3982 29.5030 13.6059 20.7620 1.4639 20.0210 1.1238 0.0132 0.2257 103.6738 80.1973 55.5101 62.9596
temp: 298.150 k
press: 1.00000 atm
elementType: 17 17 8 8 7 7 7 7 7 7 7 7 6 6 6 6 6 6 6 6 6 6 6 6 6 6 6 6 6 6 6 6 6 6 1 1 1 1 1 1 1 1 1 1 1 1 1 1 1 1 1 1 1 1
symmnumber: 1
zpe: 1054879.6 jmol-1
zpe.correction: 0.401782 hartree
zpe.thermalcorrener: 0.432301 hartree
zpe.thermalcorrenthalpy: 0.433245 hartree
zpe.thermalcorrgfe: 0.335189 hartree
zpe.sumelectzpe: -2356.474571 hartree
zpe.sumelectthermal: -2356.444052 hartree
zpe.sumelectthermalent: -2356.443108 hartree
zpe.sumelectthermalfe: -2356.541164 hartree
dipole: -13.6441 1.4814 -0.4176
dipole: 13.7306
quadrupole: -324.0066 -206.2407 -209.6360
quadrupole: 12.8013 -2.2415 -10.3806
quadrupole: -77.3788 40.3871 36.9917 12.8013 -2.2415 -10.3806
hfenergy: -2356.8763533 hartree
pointgroup: C01 [X(C22H20Cl2N8O2)]
dipole: -5.368179 -0.6007147 0.0621358 debye
polarizability: 859.6865485|-16.6813707|341.7734943|-3.0581592|-13.0584701|161.2086998 unknown
InChI: InChI=1S/C22H20Cl2N8O2/c23-9-11-31(12-10-24)15-5-1-13(2-6-15)17-19(25)29-22-18(27-17)20(26)28-21(30-22)14-3-7-16(8-4-14)32(33)34/h1-8H,9-12,25-26H2
charge 0 multiplicity 1
54 atoms
Cl -9.134788 3.182077 0.745546
Cl -8.549921 -3.502868 -1.543239
O  9.918037 1.35364 -0.28388
O  10.109545 -0.843966 0.295591
N  -6.902518 -0.318428 0.55943
N  -0.436994 -0.661917 0.168006
N  0.799583 1.802831 -0.586728
N  2.942213 0.837421 -0.252377
N  3.140115 -1.528614 0.374911
N  -1.28155 2.732399 -1.006199
N  1.224469 -2.854624 0.726933
N  9.406595 0.20329 0.010257
C  -5.518947 -0.119458 0.373632
C  -7.760296 0.764496 1.075875
C  -7.52901 -1.619739 0.260268
C  -2.672929 0.274018 0.030899
C  -4.675949 -1.15997 -0.133304
C  -4.893082 1.123903 0.701526
C  -3.295355 -0.965148 -0.28369
C  -3.509408 1.308801 0.535531
C  -1.204858 0.415782 -0.107189
C  -8.154274 1.766116 -0.028313
C  -7.861378 -1.771334 -1.237839
C  0.929251 -0.529966 0.092251
C  -0.547911 1.657146 -0.553825
C  1.568991 0.713965 -0.241712
C  1.78798 -1.654496 0.399785
C  3.651123 -0.283189 0.052697
C  5.135483 -0.163207 0.041923
C  5.74343 1.08243 -0.275649
C  5.951882 -1.285749 0.347886
C  7.142666 1.210379 -0.287853
C  7.353094 -1.173081 0.339289
C  7.930522 0.077224 0.020813
H  -7.255724 1.301848 1.899425
H  -8.675702 0.321435 1.50388
H  -8.459073 -1.712751 0.84719
H  -6.870511 -2.447655 0.578879
H  -5.092963 -2.132031 -0.411562
H  -5.475079 1.952877 1.114078
H  -2.670509 -1.781854 -0.659051
H  -3.071249 2.257936 0.864575
H  -8.816561 1.321284 -0.785481
H  -7.280072 2.230955 -0.506347
H  -6.972118 -1.682082 -1.878467
H  -8.64629 -1.075228 -1.568625
H  5.090278 1.92815 -0.507432
H  5.461248 -2.232191 0.588652
H  -2.286974 2.674015 -1.143951
H  -0.759073 3.53676 -1.352041
H  7.634058 2.156537 -0.528077
H  8.002994 -2.020694 0.570848
H  0.207623 -2.917068 0.769434
H  1.822088 -3.644307 0.959822
