program: Gaussian 09
title: 000270705
version: EM64L-G09RevD.01
frameworkgroup: C1[X(C17H21N7O3)]
method: RPBEPBE
basis: SDD
operation: Freq
keyword: #p
keyword: freq=noraman
keyword: PBEPBE/SDD
title: #p freq=noraman PBEPBE/SDD
converged: YES YES NO NO
title: Mulliken charges:
elementType: O O O N N N N N N N C C C C C C C C C C C C C C C C C H H H H H H H H H H H H H H H H H H H H H
charge: -0.427416 -0.428844 -0.224193 -0.147758 0.026526 -0.003766 -0.635614 -0.038216 -0.111202 -0.585397 0.444630 -0.440473 -0.451831 0.326169 -0.363616 -0.390692 -0.320463 -0.317193 -0.410389 -0.439480 -0.023784 0.048613 -0.122870 -0.039967 0.127466 -0.047813 -0.508236 0.235296 0.248212 0.225612 0.222391 0.236888 0.221096 0.244213 0.185765 0.194124 0.251454 0.269336 0.266389 0.334257 0.333650 0.329773 0.341090 0.325890 0.333430 0.236444 0.233772 0.236728
chargesum: 0.00000
title: Mulliken charges with hydrogens summed into heavy atoms:
elementType: O O O N N N N N N N C C C C C C C C C C C C C C C C C
charge: -0.093159 -0.095195 -0.224193 -0.147758 0.026526 -0.003766 0.035248 -0.038216 -0.111202 0.073922 0.444630 0.043035 -0.003828 0.326169 -0.126727 -0.169596 0.109514 0.128385 -0.141053 -0.173091 -0.023784 0.048613 -0.122870 -0.039967 0.127466 -0.047813 0.198708
polarizability: 5.40179064e+02 -1.98887881e+01 2.60209638e+02 -1.16740492e+01 1.59814297e+01 1.40449970e+02
1716.lowfreq: -6.8646 -3.3046 -1.1864 -0.0007 -0.0001 0.0005 15.9650 19.8008 32.0357
frequency: 15.5924 19.7920 32.0282 39.4530 51.0676 70.1139 78.3507 97.7448 103.7243 117.4698 123.2876 130.6427 144.6220 148.4982 182.6125 186.6104 219.9689 225.2757 246.3407 252.6347 281.1661 284.8762 303.6216 309.5623 313.9247 333.5855 345.8943 363.3194 404.0839 406.6383 427.1567 441.0137 456.0632 459.9133 463.5896 481.2214 492.3192 523.9473 541.9502 543.3313 556.1884 567.7684 586.2771 593.7171 630.4704 645.9547 653.9966 662.1096 712.0679 726.5495 737.7806 753.8730 762.0163 795.5279 801.8224 805.1623 810.0865 830.5641 831.7944 902.7493 909.8074 954.1387 960.4630 965.3614 970.0366 978.9511 992.6217 1010.2894 1018.7288 1025.9653 1038.0795 1042.5711 1050.5774 1070.1857 1111.1955 1134.0150 1141.3270 1146.4610 1165.4339 1178.3892 1205.6663 1214.0890 1229.0890 1261.9959 1281.0350 1288.1299 1291.9896 1293.2452 1319.9395 1326.6583 1335.8765 1346.4430 1362.9822 1364.4327 1372.3571 1376.8209 1380.8230 1396.7101 1397.0517 1422.0060 1432.9010 1449.3183 1452.8533 1458.8119 1459.9527 1466.0674 1471.6028 1477.2401 1482.2236 1497.4058 1522.7504 1527.0703 1545.4042 1555.3762 1602.0405 1609.5087 1627.1618 2951.8655 2956.9905 2977.6599 3000.3401 3005.6762 3030.1504 3060.9329 3094.1899 3095.7608 3101.9824 3122.9935 3142.8891 3148.0080 3156.2637 3169.4527 3525.2636 3554.3202 3559.7230 3560.8807 3683.3977 3722.2090
redmass: 5.5390 5.9872 6.0557 5.0708 5.8034 4.0532 5.4076 4.1179 4.5193 2.4345 2.7462 4.2746 1.8591 1.8215 4.6278 5.3358 4.5854 4.7782 3.0585 3.7810 1.3807 7.1511 2.9809 1.6280 3.3539 2.8811 4.1870 3.3987 3.1724 3.5879 2.7652 4.7102 1.4630 3.5845 2.6105 1.6320 2.4870 2.7567 1.3843 2.0170 3.8073 3.7231 1.6262 4.2537 7.1856 5.0814 5.8216 9.0333 6.8623 5.2822 4.9989 5.8352 8.5356 1.2269 4.5348 9.2318 1.4115 1.7910 3.0860 2.1425 7.3575 1.4203 3.9275 4.7526 1.3797 2.9657 3.2440 2.0574 2.0889 3.6122 2.9242 1.8954 4.4642 1.5866 1.2551 1.7518 1.4284 1.6682 2.3089 1.5055 1.4144 1.7130 2.9327 1.4091 1.2876 5.4625 1.2662 4.4778 1.4182 1.3056 7.4552 1.3668 1.4021 2.8790 1.2361 2.8121 1.2918 2.8217 3.5186 2.3258 3.7288 1.0536 3.6520 1.0876 1.3152 1.1357 2.2141 1.0970 3.2772 1.1114 3.2480 5.7970 5.5672 4.7138 1.3891 1.7350 5.8520 1.0681 1.0698 1.0619 1.0291 1.0618 1.1010 1.0998 1.0967 1.0954 1.1042 1.0881 1.1048 1.0873 1.0934 1.0957 1.0445 1.0664 1.0663 1.0440 1.1048 1.1059
irintensity: 0.8033 0.4377 1.1581 2.4171 1.6833 0.9454 1.0718 9.3952 1.3229 7.4070 8.6185 0.5204 0.6738 0.3920 4.3156 5.1232 3.1110 0.3220 26.3153 4.5138 132.2781 7.9471 15.9272 112.5540 25.3803 90.4242 17.7861 2.0456 2.8029 5.8956 43.5207 2.0781 238.5250 82.7457 11.2295 104.2273 34.8345 15.5921 34.0356 9.0184 7.8340 20.4873 66.9505 12.4888 5.1898 0.6876 7.6780 2.3596 4.0074 2.5210 0.8229 5.9217 9.5222 8.0326 10.3046 4.6592 7.9875 51.1445 6.0614 65.7455 6.6742 3.4261 79.9055 7.2282 17.4799 127.1671 11.3213 51.9192 13.7620 4.1964 9.0918 15.1752 47.7751 54.4311 0.1072 9.6669 29.1692 9.8065 105.7042 28.4188 170.4559 8.5559 5.7730 120.1851 25.5698 24.3734 12.0983 87.3361 3.5935 34.7708 103.9988 36.0585 65.9233 27.8455 24.8539 80.9981 17.2180 114.8547 12.1944 168.9314 47.2983 13.0526 239.4334 5.2446 111.5775 18.8360 115.2292 18.0756 281.0457 3.0165 365.7910 98.9476 384.4601 150.1401 473.6958 597.0970 310.1962 57.5166 46.2424 119.6057 59.9187 44.4833 24.1271 7.6893 18.4971 43.9610 28.5441 10.0879 17.1379 7.6817 31.4193 17.1496 79.7686 6.3481 10.2902 222.2688 52.8271 44.8548
temp: 298.150 k
press: 1.00000 atm
elementType: 8 8 8 7 7 7 7 7 7 7 6 6 6 6 6 6 6 6 6 6 6 6 6 6 6 6 6 1 1 1 1 1 1 1 1 1 1 1 1 1 1 1 1 1 1 1 1 1
symmnumber: 1
zpe: 990628.0 jmol-1
zpe.correction: 0.377310 hartree
zpe.thermalcorrener: 0.403490 hartree
zpe.thermalcorrenthalpy: 0.404434 hartree
zpe.thermalcorrgfe: 0.319254 hartree
zpe.sumelectzpe: -1267.345128 hartree
zpe.sumelectthermal: -1267.318948 hartree
zpe.sumelectthermalent: -1267.318004 hartree
zpe.sumelectthermalfe: -1267.403185 hartree
dipole: 5.3430 -1.7737 -0.3087
dipole: 5.6382
quadrupole: -91.1057 -148.1636 -168.3160
quadrupole: -29.1872 -5.7994 7.0544
quadrupole: 44.7560 -12.3018 -32.4542 -29.1872 -5.7994 7.0544
hfenergy: -1267.7224384 hartree
pointgroup: C01 [X(C17H21N7O3)]
dipole: -2.1057386 0.2746882 0.6410303 debye
polarizability: 540.5784392|-6.3887105|160.9374113|-18.8804518|47.9963099|239.3228219 unknown
InChI: InChI=1S/C17H21N7O3/c1-27-16-13-15(22-17(19)23-16)21-14(18)12(20-13)10-2-4-11(5-3-10)24(6-8-25)7-9-26/h2-5,25-26H,6-9,18-19H2,1H3
charge 0 multiplicity 1
48 atoms
O  -6.090658 0.374941 -3.422549
O  -6.549666 -2.436023 1.166054
O  3.500868 -1.345848 -2.260152
N  -4.648454 -0.222139 0.050862
N  1.824721 -0.166438 -0.322918
N  3.082375 1.291946 1.787407
N  1.021691 2.094676 2.479292
N  5.21121 0.573445 1.049886
N  5.40648 -0.736743 -1.02667
N  7.281637 -0.137106 0.231694
C  -3.260726 -0.065121 0.203772
C  -5.244174 -0.539415 -1.259402
C  -5.553618 -0.132976 1.205358
C  -0.40309 0.309713 0.505672
C  -2.382152 -0.043254 -0.929048
C  -2.656678 0.074492 1.493558
C  -5.578389 0.725131 -2.090934
C  -5.768032 -1.469216 1.956234
C  -1.000057 0.127226 -0.773564
C  -1.269166 0.262698 1.63345
C  1.068462 0.456771 0.607042
C  1.736063 1.269051 1.635184
C  3.191932 -0.094595 -0.21917
C  3.843808 0.584785 0.884675
C  4.071542 -0.730744 -1.172372
C  5.913434 -0.090107 0.097313
C  4.423454 -2.004167 -3.211046
H  -6.161165 -1.133239 -1.086408
H  -4.568601 -1.187426 -1.845301
H  -6.536911 0.241394 0.856306
H  -5.171069 0.624546 1.916186
H  -2.780145 -0.152023 -1.941862
H  -3.25784 0.000665 2.404324
H  -4.667135 1.311972 -2.287149
H  -6.29448 1.370126 -1.536704
H  -6.253927 -1.272905 2.937151
H  -4.801466 -1.967314 2.132045
H  -0.344313 0.118431 -1.650146
H  -0.853111 0.29773 2.647254
H  -6.943334 -0.120227 -3.326554
H  -7.499065 -2.151943 1.158724
H  1.558878 2.680403 3.117645
H  0.02488 2.247449 2.350823
H  7.835278 -0.622261 -0.468134
H  7.709844 0.322203 1.030962
H  5.126655 -1.270002 -3.639362
H  3.76015 -2.420321 -3.982699
H  4.997761 -2.798745 -2.705331
