program: Gaussian 09
title: 000270704
version: EM64L-G09RevD.01
frameworkgroup: C1[X(C16H19N7O2)]
method: RPBEPBE
basis: SDD
operation: Freq
keyword: #p
keyword: freq=noraman
keyword: PBEPBE/SDD
title: #p freq=noraman PBEPBE/SDD
converged: YES YES NO NO
title: Mulliken charges:
elementType: O O N N N N N N N C C C C C C C C C C C C C C C C H H H H H H H H H H H H H H H H H H H
charge: -0.448213 -0.509412 -0.150086 -0.051230 0.014971 -0.634808 -0.002823 -0.051002 -0.605066 0.456801 -0.478371 -0.345330 0.326247 -0.358101 -0.384180 -0.289490 -0.364188 -0.414157 -0.438635 -0.019165 0.050787 -0.084770 -0.062206 0.120426 -0.393247 0.212833 0.259149 0.210206 0.256672 0.221544 0.235134 0.227931 0.183395 0.218273 0.218736 0.250980 0.272042 0.379323 0.375711 0.333962 0.342786 0.240808 0.329693 0.346072
chargesum: 0.00000
title: Mulliken charges with hydrogens summed into heavy atoms:
elementType: O O N N N N N N N C C C C C C C C C C C C C C C C
charge: -0.068890 -0.133701 -0.150086 -0.051230 0.014971 0.041939 -0.002823 -0.051002 0.070698 0.456801 -0.006389 0.121547 0.326247 -0.136556 -0.149046 0.121837 0.072822 -0.163177 -0.166593 -0.019165 0.050787 -0.084770 -0.062206 0.120426 -0.152440
polarizability: 4.79079048e+02 2.82042380e+01 2.43117181e+02 -1.33205354e+01 1.24132991e+01 1.25536150e+02
1716.lowfreq: -4.9861 -2.6662 -0.0008 -0.0006 0.0002 8.3245 21.7829 28.3079 40.4619
frequency: 21.7229 28.1569 40.4127 56.7867 67.4897 94.7033 114.1591 124.8947 139.6730 148.8910 171.2606 191.7687 197.3646 216.6728 235.2359 242.1546 250.7487 268.6777 305.1931 329.1541 341.2357 362.5149 393.2640 403.6537 416.9117 453.2712 463.6955 466.2742 469.1538 480.4300 510.7851 525.9763 532.4686 548.6631 560.2706 567.8984 587.4119 594.7389 612.0892 617.3312 637.7683 674.3005 696.0213 700.0385 710.8535 726.6669 766.8957 781.2296 807.6216 819.4982 826.1193 833.3563 856.5758 858.7773 892.9507 919.3666 942.4031 954.4167 966.5650 969.9921 982.0435 988.4496 1017.5222 1032.9252 1048.6567 1050.9435 1066.3521 1093.4062 1122.2204 1136.9788 1166.2029 1195.5910 1199.3905 1208.5000 1212.9734 1223.4296 1251.2517 1258.7696 1280.5318 1299.1743 1313.4779 1322.6311 1331.0388 1340.4266 1351.7162 1356.9678 1368.0323 1378.7515 1387.3329 1407.5525 1414.1351 1419.9571 1424.5472 1436.5630 1454.5472 1464.2755 1474.9722 1478.7328 1492.6476 1509.6311 1517.1153 1521.7213 1532.3564 1550.8547 1602.2927 1606.0076 1626.7469 2924.8367 2949.0851 2972.0172 3014.1077 3020.5293 3034.2638 3054.2811 3088.1231 3127.3464 3143.8115 3150.3738 3167.8545 3172.4566 3335.7542 3525.5261 3527.1876 3600.1523 3683.9960 3687.5278
redmass: 6.0800 5.2817 5.6624 5.6365 4.0651 5.7382 4.6015 6.2648 4.0988 5.5926 4.2516 4.0142 3.4892 3.1858 3.4493 1.9323 2.3329 8.3515 2.9184 4.4163 3.5959 3.6527 4.6693 3.1220 2.8873 3.2158 2.7857 2.2868 3.0124 1.9160 2.3726 1.4968 4.6591 2.6169 4.2790 3.0617 1.5257 3.4802 1.0716 4.5043 6.3514 9.7450 8.4063 1.1373 4.0751 3.9113 7.7362 5.8991 1.3244 5.0912 2.4958 2.9034 6.4274 2.8626 1.9137 3.0695 1.4657 1.3699 1.4645 2.3203 2.8055 2.3269 2.6839 2.8699 2.7359 2.6290 1.9108 2.0981 3.9743 1.6371 1.7432 2.7834 1.3616 1.1492 1.1914 1.1729 3.8900 1.5898 6.3617 1.2250 2.1259 1.8340 4.2510 1.6772 1.3739 2.8123 2.9041 1.4980 1.3994 1.5553 4.9468 1.2767 2.5761 3.4781 3.1345 1.2332 1.0865 1.0858 1.1011 3.8076 3.2881 3.9449 4.1571 6.0184 1.8420 1.4430 5.9942 1.0701 1.0622 1.0581 1.0954 1.0666 1.1074 1.0928 1.0964 1.0892 1.0876 1.0916 1.0935 1.0939 1.0679 1.0439 1.0446 1.0668 1.1049 1.1052
irintensity: 0.6436 3.1421 1.0910 1.6381 3.5467 1.5140 3.7549 7.6377 5.5305 0.9987 6.0144 3.5795 35.0112 35.1929 22.6717 43.0159 43.9803 2.1309 17.7303 10.0072 3.4898 1.2908 1.9159 24.2374 0.7702 2.7442 43.7038 79.9276 22.2244 21.5945 16.4554 152.5410 9.3327 8.6184 22.3198 61.4330 93.0186 7.4934 57.8895 10.7222 3.2499 10.3011 4.6930 156.1013 24.9399 3.5856 7.0324 8.3422 1.0286 8.3416 39.5990 24.3826 2.2253 26.5525 37.3372 65.8253 9.9543 0.1570 6.9476 4.2877 29.0346 37.4755 5.6310 21.0460 76.2233 8.4950 30.7823 42.7233 2.8994 3.1414 48.3494 60.7302 57.0631 4.7049 106.3382 24.1102 56.5791 35.7318 25.9605 94.6465 10.6348 21.9105 79.7174 101.0585 44.1533 36.8451 49.3118 21.1708 39.7905 0.8645 71.1695 81.7305 158.2825 5.9255 166.0108 18.2517 4.2495 11.7741 14.9792 222.7078 185.6611 51.7304 42.5102 7.7303 523.7747 88.5477 456.8706 103.4831 55.6800 40.1082 32.6290 55.5024 51.9824 24.0502 40.0779 7.3731 6.3003 34.3173 21.0429 19.9410 270.1247 119.3684 33.4034 17.6101 56.9981 71.2631
temp: 298.150 k
press: 1.00000 atm
elementType: 8 8 7 7 7 7 7 7 7 6 6 6 6 6 6 6 6 6 6 6 6 6 6 6 6 1 1 1 1 1 1 1 1 1 1 1 1 1 1 1 1 1 1 1
symmnumber: 1
zpe: 912715.7 jmol-1
zpe.correction: 0.347635 hartree
zpe.thermalcorrener: 0.370090 hartree
zpe.thermalcorrenthalpy: 0.371035 hartree
zpe.thermalcorrgfe: 0.295446 hartree
zpe.sumelectzpe: -1152.990569 hartree
zpe.sumelectthermal: -1152.968114 hartree
zpe.sumelectthermalent: -1152.967170 hartree
zpe.sumelectthermalfe: -1153.042758 hartree
dipole: -12.4596 -1.7216 3.3489
dipole: 13.0162
quadrupole: -142.2891 -130.8277 -152.5542
quadrupole: 28.2391 -10.3298 7.5535
quadrupole: -0.3987 11.0626 -10.6639 28.2391 -10.3298 7.5535
hfenergy: -1153.3382043 hartree
pointgroup: C01 [X(C16H19N7O2)]
dipole: -4.9047817 1.0723069 -1.0087246 debye
polarizability: 478.0078562|-34.3499628|231.112888|-0.2842181|39.737702|138.6116344 unknown
InChI: InChI=1S/C16H19N7O2/c17-14-13-16(20-9-19-14)22-15(18)12(21-13)10-1-3-11(4-2-10)23(5-7-24)6-8-25/h1-4,9,24-25H,5-8,17-18H2
charge 0 multiplicity 1
44 atoms
O  -5.460494 -2.077027 0.979101
O  -7.147102 0.039325 0.583405
N  -4.090079 0.277456 -0.276877
N  2.357161 -0.632211 -0.221541
N  3.799198 1.736675 0.477678
N  1.82264 2.948753 0.487745
N  5.851272 0.531633 0.383997
N  5.846874 -1.840303 -0.281458
N  3.826826 -2.964048 -0.7616
C  -2.689109 0.303146 -0.155977
C  -4.745235 -0.801188 -1.049323
C  -4.888196 1.024377 0.722014
C  0.203125 0.474049 -0.010146
C  -1.843929 -0.437558 -1.047711
C  -2.03158 1.086258 0.847892
C  -4.791878 -2.165055 -0.315678
C  -6.354965 1.271045 0.357596
C  -0.447826 -0.351112 -0.969644
C  -0.629351 1.174656 0.906211
C  1.682584 0.505828 0.051198
C  2.449698 1.727207 0.354881
C  3.732352 -0.617478 -0.134944
C  4.470272 0.554198 0.254296
C  4.487209 -1.823447 -0.398707
C  6.435562 -0.656962 0.105509
H  -4.241705 -0.918988 -2.025947
H  -5.778141 -0.48908 -1.271449
H  -4.439639 2.031688 0.826629
H  -4.849883 0.532457 1.717613
H  -2.277306 -1.082962 -1.815954
H  -2.606725 1.601959 1.620363
H  -3.771927 -2.531691 -0.106526
H  -5.298044 -2.900038 -0.982942
H  -6.449869 1.604111 -0.695949
H  -6.734288 2.071466 1.022963
H  0.171893 -0.92916 -1.663105
H  -0.180227 1.741899 1.729943
H  -6.241176 -1.452489 0.900211
H  -8.115356 0.225081 0.526233
H  2.420046 3.761141 0.636569
H  0.832883 3.063126 0.285702
H  7.526323 -0.691855 0.19914
H  4.35714 -3.816157 -0.927527
H  2.80877 -2.940423 -0.809986
