program: Gaussian 09
title: 000270702
version: EM64L-G09RevD.01
frameworkgroup: C1[X(C5H8N4)]
method: RPBEPBE
basis: SDD
operation: Freq
keyword: #p
keyword: freq=noraman
keyword: PBEPBE/SDD
title: #p freq=noraman PBEPBE/SDD
converged: YES YES NO NO
title: Mulliken charges:
elementType: N N N N C C C C C H H H H H H H H
charge: -0.351507 -0.028653 -0.058107 -0.541098 0.129957 0.082480 -0.770660 -0.308952 -0.261310 0.223036 0.260349 0.223256 0.323629 0.241217 0.237858 0.292883 0.305622
chargesum: 0.00000
title: Mulliken charges with hydrogens summed into heavy atoms:
elementType: N N N N C C C C C
charge: -0.027878 -0.028653 -0.058107 0.057406 0.129957 0.082480 -0.064019 -0.067735 -0.023452
polarizability: 1.17663253e+02 3.73307877e+00 8.36188308e+01 -2.21129389e+00 2.25268351e+00 4.37392541e+01
1716.lowfreq: -19.3045 -12.4492 -9.8514 -0.0008 -0.0008 -0.0006 63.9016 131.7702 188.0254
frequency: 63.8801 131.7690 187.9702 231.6239 254.7314 324.7969 352.6907 446.4297 461.4217 520.7942 556.7942 575.0754 600.5069 686.9575 711.0904 767.6875 840.6869 885.4538 933.8649 955.9835 1037.8121 1056.2419 1140.5156 1174.8949 1239.1619 1243.2660 1262.3953 1315.7157 1386.9298 1399.5435 1423.5481 1457.5800 1463.1636 1468.9595 1522.8088 1532.4674 1662.3769 2980.7146 3060.8321 3107.3330 3135.9684 3165.9323 3439.7143 3499.6823 3584.8092
redmass: 3.3802 3.8528 1.0680 3.4202 2.3286 2.0953 1.6367 4.6209 4.9371 1.3638 3.6682 6.2128 4.2456 1.6407 2.7618 4.5092 1.2856 5.8888 1.4378 1.7763 1.5190 2.7123 3.0527 3.9932 1.2007 2.1080 5.6718 2.3963 1.2692 1.6157 3.4907 1.4382 1.4563 1.0568 4.4018 3.8882 1.0693 1.0375 1.0976 1.0978 1.0882 1.0988 1.0433 1.0762 1.1020
irintensity: 3.1970 6.8258 0.8929 0.9395 1.4875 19.6853 12.1800 32.8628 0.7567 267.9160 1.1269 6.7615 34.7258 105.5312 64.7649 0.4419 29.6085 6.3313 0.8039 13.0817 4.6794 1.1647 11.1995 2.2503 5.7205 10.9834 24.0255 0.3326 35.4270 9.9102 196.7003 22.2717 31.1153 18.6000 59.8868 53.8853 19.3547 21.8289 22.2284 9.5405 5.9801 40.0135 2.1123 32.7893 2.8084
temp: 298.150 k
press: 1.00000 atm
elementType: 7 7 7 7 6 6 6 6 6 1 1 1 1 1 1 1 1
symmnumber: 1
zpe: 354409.1 jmol-1
zpe.correction: 0.134987 hartree
zpe.thermalcorrener: 0.143606 hartree
zpe.thermalcorrenthalpy: 0.144550 hartree
zpe.thermalcorrgfe: 0.101696 hartree
zpe.sumelectzpe: -413.616960 hartree
zpe.sumelectthermal: -413.608341 hartree
zpe.sumelectthermalent: -413.607397 hartree
zpe.sumelectthermalfe: -413.650251 hartree
dipole: 1.5054 0.5759 0.4924
dipole: 1.6854
quadrupole: -47.0890 -57.3746 -53.3267
quadrupole: 6.4449 0.7078 -0.5754
quadrupole: 5.5078 -4.7779 -0.7299 6.4449 0.7078 -0.5754
hfenergy: -413.7519472 hartree
pointgroup: C01 [X(C5H8N4)]
dipole: -0.481073 0.3590681 -0.2816474 debye
dipolederiv: -1.0061904 0.121692 0.0873886 0.0063582 0.0420187 -0.2880355 0.4887481 -0.265651 -0.3456149 0.0219738 -0.1234812 0.0306234 -0.1903351 -0.170349 -0.0162627 0.0139733 -0.0230926 -0.2549607 -0.6287612 -0.1784198 0.055553 0.3103381 -0.2820244 -0.0235803 -0.1633502 0.0129526 -0.2623477 -0.6123354 -0.219738 0.0754794 -0.4871547 -0.1699755 0.0299589 0.0637226 0.0867229 -0.0155203 -0.3418045 0.0744368 -0.0414041 -0.5120551 0.498124 -0.0347734 0.2088081 -0.1138625 0.0214738 1.468121 -0.1413092 -0.0663076 0.2458549 -0.2152521 0.1523658 -0.2307353 0.1706926 0.1442838 -0.0063844 0.1239303 -0.0163717 0.1202239 -0.1700496 0.0367425 -0.0106027 0.0426284 0.0630074 0.1208489 -0.1189778 -0.0239616 0.2699245 -0.2926795 0.0360996 -0.1011473 0.100781 -0.0987636 0.1933575 0.2175604 -0.0815268 -0.2542458 0.3169333 -0.1045306 0.0792457 -0.1590386 0.0156676 0.0259011 0.0729427 0.1066343 0.0276796 0.0329175 -0.000287 0.1005596 -0.0597704 -0.0429092 -0.003607 -0.1557514 0.0206642 -0.0458036 0.0107162 0.0153915 0.0020504 0.0120704 0.1177448 0.0229939 0.0633539 -0.1287616 0.0143916 0.045028 -0.0103144 -0.1142585 0.0347463 -0.0499208 0.169968 0.0493016 -0.0549303 0.0170588 0.1195777 0.0944975 -0.1329835 0.0670824 0.2817478 -0.1118853 0.0622862 0.0247873 0.0169222 0.087535 0.0179989 0.0275428 0.012047 0.1521276 0.0321782 0.0772003 -0.0169527 0.125865 -0.0566394 0.0500345 -0.0251451 0.0592172 0.1164638 0.2393352 0.0912869 0.0993598 0.188581 0.1702494 0.0704968 -0.0577257 0.0369622 0.0208881 0.4162907 -0.0163136 -0.0702737 0.1463965 0.0338698 -0.0258021 -0.1487021 -0.0144879 0.1366324 unknown
polarizability: 110.6970598|-14.9436076|86.6550258|-1.3212384|-12.4953719|47.6692528 unknown
InChI: InChI=1S/C5H8N4/c1-4-5(9-6)8-3-2-7-4/h2-3,9H,6H2,1H3
charge 0 multiplicity 1
17 atoms
N  -1.932671 -0.353571 0.50902
N  1.585587 0.66125 -0.245156
N  0.055995 -1.534896 0.666042
N  -2.857639 0.426791 -0.212269
C  0.239628 0.799253 -0.072476
C  -0.54146 -0.342418 0.342247
C  -0.32022 2.194019 -0.259751
C  2.168941 -0.546232 0.026652
C  1.4058 -1.625616 0.521059
H  -0.913171 2.51198 0.618191
H  0.529209 2.884941 -0.380571
H  -0.966234 2.283638 -1.152094
H  -2.294544 -1.246239 0.858352
H  3.248735 -0.6219 -0.129792
H  1.867165 -2.577797 0.803154
H  -2.749411 0.400074 -1.231826
H  -3.02251 1.356622 0.178016
