program: Gaussian 09
title: 000276291
version: EM64L-G09RevD.01
frameworkgroup: C1[X(C15H13N3O)]
method: RPBEPBE
basis: SDD
operation: Freq
keyword: #p
keyword: freq=noraman
keyword: PBEPBE/SDD
title: #p freq=noraman PBEPBE/SDD
converged: NO YES NO NO
title: Mulliken charges:
elementType: O N N N C C C C C C C C C C C C C C C H H H H H H H H H H H H H
charge: -0.197040 -0.455022 -0.454747 -0.196256 0.039162 0.365944 0.060766 0.225222 0.266496 0.266287 -0.411596 -0.340976 -0.643808 -0.387992 -0.387885 -0.251170 -0.212624 -0.230673 -0.230684 0.291040 0.291098 0.267609 0.244257 0.234995 0.234944 0.272527 0.222731 0.222734 0.231712 0.228579 0.217183 0.217185
chargesum: 0.00000
title: Mulliken charges with hydrogens summed into heavy atoms:
elementType: O N N N C C C C C C C C C C C C C C C
charge: -0.197040 -0.163982 -0.163649 -0.196256 0.039162 0.365944 0.060766 0.225222 0.266496 0.266287 -0.143987 -0.096720 0.098658 -0.165261 -0.165151 -0.019458 0.015955 -0.013489 -0.013499
polarizability: 2.76223629e+02 6.50813707e+00 1.60659538e+02 -6.52482364e-03 1.68126597e-02 1.25967384e+02
1716.lowfreq: -10.1572 -6.7306 0.0006 0.0007 0.0008 0.9128 38.6999 43.1554 79.6577
frequency: 38.6950 43.1034 79.6571 120.7784 136.7498 160.8787 198.7009 224.2392 224.4859 264.2346 271.1937 298.0717 305.0623 350.6464 351.0866 369.2636 414.9798 419.0834 472.4033 489.7997 522.5644 559.1702 571.3858 574.1787 605.6261 667.0978 680.7646 700.3286 729.2673 729.7397 759.5232 762.4622 774.3069 825.4232 831.5783 863.2548 867.6149 880.4935 891.7554 909.1996 942.7220 947.8469 982.8193 993.3213 1016.0663 1018.1468 1042.6842 1082.4257 1094.3467 1120.3933 1126.1951 1128.9089 1165.8984 1171.3125 1215.6779 1220.7894 1248.4751 1255.7479 1273.0540 1304.2036 1331.9555 1353.1726 1378.4448 1406.7339 1427.1982 1450.2625 1454.6583 1457.9684 1476.9930 1477.7269 1486.9810 1505.2749 1607.3383 1621.9367 1622.5663 1628.4097 1658.9521 2977.9789 3060.1819 3104.9502 3127.5926 3132.6500 3137.3171 3146.2718 3149.0512 3157.1977 3166.4522 3169.7195 3603.4511 3604.6906
redmass: 5.7641 4.9806 3.8826 4.1351 3.5809 1.0740 4.7646 2.4370 5.2639 4.1659 3.6958 2.1010 2.8982 5.2675 2.2595 1.9069 3.7783 3.1107 8.3821 3.7148 5.2751 4.0249 3.8733 6.7089 6.4157 6.3134 6.4481 6.8230 1.2164 4.5365 3.6632 1.3620 5.4577 4.6941 1.3998 5.2218 1.4545 4.6060 1.4030 5.2959 1.2811 1.3985 1.3223 5.2900 2.0620 2.2488 3.9500 2.7767 2.3191 1.4208 1.5372 2.0959 1.0597 1.0876 2.3878 4.1530 2.3487 1.3758 2.3303 1.8895 4.6755 1.2974 3.2221 5.1516 1.2362 2.2684 2.2957 2.5698 2.1264 1.0438 1.3592 5.7468 7.6401 7.4980 7.4363 6.7890 10.6825 1.0342 1.1021 1.0993 1.0845 1.0857 1.0897 1.0898 1.0947 1.0949 1.1004 1.1002 1.0780 1.0805
irintensity: 0.7410 2.0920 0.3839 0.0112 5.3698 0.0771 2.5944 4.7274 1.0879 5.7133 6.0898 51.6808 8.2754 21.1767 13.9258 160.3960 0.2152 4.1531 0.9897 25.0552 11.5399 1.2190 2.8047 5.2972 7.1910 1.9207 3.5967 0.8353 112.8174 0.0046 1.4096 90.6581 3.2734 6.2926 0.3297 1.5958 0.3342 2.1491 5.7817 7.3660 0.0012 2.4655 0.0000 74.2118 31.2270 9.7883 15.9989 0.4476 76.6739 4.5093 29.6716 15.3276 1.1000 6.9171 18.2032 2.0283 4.5281 0.7395 87.2875 62.2054 66.6769 4.3301 319.7132 4.4549 10.9450 37.2994 19.2757 0.6639 148.3920 17.4156 4.5503 364.3165 73.5862 10.7053 95.6509 28.3981 202.7088 58.1035 25.7762 1.3061 0.7670 1.9238 12.8601 9.2408 36.1653 19.6545 26.9575 20.4757 50.5272 10.7599
temp: 298.150 k
press: 1.00000 atm
elementType: 8 7 7 7 6 6 6 6 6 6 6 6 6 6 6 6 6 6 6 1 1 1 1 1 1 1 1 1 1 1 1 1
symmnumber: 1
zpe: 653005.3 jmol-1
zpe.correction: 0.248717 hartree
zpe.thermalcorrener: 0.264275 hartree
zpe.thermalcorrenthalpy: 0.265219 hartree
zpe.thermalcorrgfe: 0.206001 hartree
zpe.sumelectzpe: -817.568859 hartree
zpe.sumelectthermal: -817.553300 hartree
zpe.sumelectthermalent: -817.552356 hartree
zpe.sumelectthermalfe: -817.611574 hartree
dipole: -4.8881 -0.8488 -0.0003
dipole: 4.9612
quadrupole: -98.9081 -114.6598 -101.3210
quadrupole: -5.7754 -0.0077 0.0120
quadrupole: 6.0549 -9.6968 3.6419 -5.7754 -0.0077 0.0120
hfenergy: -817.8175752 hartree
pointgroup: C01 [X(C15H13N3O1)]
dipole: 1.9254173 -0.3204296 0.0002634 debye
polarizability: 276.3092918|-5.6964001|160.573852|-0.0023978|-0.0327875|125.9674063 unknown
InChI: InChI=1S/C15H13N3O/c1-18-13-9-5-2-6-10(13)15(14(18)19)16-11-7-3-4-8-12(11)17-15/h2-9,16-17H,1H3
charge 0 multiplicity 1
32 atoms
O  0.039293 2.703413 -0.000527
N  -0.819411 -0.100248 1.139979
N  -0.818763 -0.099052 -1.13848
N  2.087878 1.517406 0.000462
C  0.08896 0.141135 0.001167
C  1.366536 -0.699128 0.001166
C  0.689414 1.628685 0.002515
C  2.500174 0.151703 0.000625
C  -2.165651 -0.157647 0.713531
C  -2.165239 -0.157027 -0.712892
C  1.52225 -2.089599 0.001081
C  3.809888 -0.359822 -0.000076
C  2.993438 2.665807 -0.001465
C  -3.36043 -0.249993 1.438908
C  -3.359599 -0.248751 -1.439042
C  2.836042 -2.630086 0.000648
C  3.960424 -1.771106 0.000079
C  -4.579761 -0.335901 0.704866
C  -4.579353 -0.335284 -0.705777
H  -0.542007 0.174739 2.079706
H  -0.540828 0.17693 -2.077754
H  0.640484 -2.738871 0.001348
H  4.686414 0.295852 -0.000636
H  3.635131 2.663687 -0.901897
H  3.63782 2.664483 0.897043
H  2.374924 3.578192 -0.00092
H  -3.365657 -0.249163 2.53416
H  -3.364199 -0.246912 -2.534295
H  2.981612 -3.715289 0.000643
H  4.968671 -2.200303 -0.000356
H  -5.527786 -0.399484 1.249866
H  -5.527067 -0.398366 -1.251377
