program: Gaussian 09
title: 000276286
version: EM64L-G09RevD.01
frameworkgroup: C1[X(C13H8Cl2N4)]
method: RPBEPBE
basis: SDD
operation: Freq
keyword: #p
keyword: freq=noraman
keyword: PBEPBE/SDD
title: #p freq=noraman PBEPBE/SDD
converged: YES YES NO NO
title: Mulliken charges:
elementType: Cl Cl N N N N C C C C C C C C C C C C C H H H H H H H H
charge: -0.008988 0.006124 -0.069335 0.018791 0.009184 -0.651563 0.047208 0.115188 0.368338 0.071816 0.301468 -0.425091 -0.336268 -0.356479 -0.423733 -0.455654 -0.082556 -0.214576 -0.106263 0.241250 0.287762 0.236596 0.268339 0.239836 0.262077 0.340574 0.315953
chargesum: 0.00000
title: Mulliken charges with hydrogens summed into heavy atoms:
elementType: Cl Cl N N N N C C C C C C C C C C C C C
charge: -0.008988 0.006124 -0.069335 0.018791 0.009184 0.004964 0.047208 0.115188 0.368338 0.071816 0.301468 -0.183840 -0.048506 -0.119883 -0.155394 -0.215818 -0.082556 0.047501 -0.106263
polarizability: 3.65553716e+02 1.34834780e+01 2.11577523e+02 2.03271746e+00 -1.95088119e+00 7.17392183e+01
1716.lowfreq: -7.9188 -3.2519 -0.0028 -0.0025 -0.0018 1.6107 16.3997 39.2492 65.0537
frequency: 16.3752 39.2456 65.0498 96.0700 145.7156 171.8983 178.4734 195.0006 202.5410 227.9794 260.4239 303.4761 346.7937 395.6289 411.8150 438.6059 439.6113 453.1381 459.4045 505.4139 519.8976 530.7661 552.6588 574.3286 593.4392 600.1530 603.2174 663.8165 685.0365 696.4121 722.5431 758.0458 795.4250 822.1504 846.7963 863.9357 887.9425 908.9858 911.8061 920.6333 954.7546 1000.4621 1006.6154 1061.9658 1108.0402 1118.3300 1140.9210 1157.4169 1225.0698 1241.7267 1271.8261 1291.5732 1310.2835 1341.0943 1359.9749 1362.4878 1388.7704 1400.3869 1433.8209 1460.3962 1471.8337 1507.3346 1547.7144 1559.6238 1563.0168 1595.0199 1612.8859 3123.1303 3138.0687 3158.3266 3159.1263 3176.4830 3179.6047 3533.0213 3689.7051
redmass: 7.2327 8.8446 8.5708 7.4392 5.8917 4.4107 23.2711 5.7741 5.2791 11.1529 5.9439 5.4994 5.8842 8.1290 1.9341 3.2360 5.4549 1.9246 7.0995 5.9301 6.0100 5.8353 6.5447 1.1256 5.1139 5.3152 8.7841 7.5506 9.6705 4.0767 3.0002 8.5862 2.4289 1.4294 5.8119 1.9442 1.5674 1.7563 3.6103 1.6351 1.3648 5.0105 2.0724 3.3933 3.5207 2.3767 2.3395 1.5127 2.6709 1.4951 6.6106 2.2529 2.5803 1.7100 4.1139 4.6573 4.5953 2.5247 3.4313 4.7582 3.3651 6.1856 6.5244 4.6214 4.5954 6.6345 1.4805 1.0907 1.0914 1.0929 1.0879 1.0932 1.0953 1.0455 1.1033
irintensity: 1.4775 1.2962 0.8544 0.0824 1.6058 1.1683 0.1527 1.0326 1.4857 0.2779 4.0967 5.3229 1.2348 12.8803 53.2921 7.9064 6.0557 99.9306 18.2778 4.5219 1.4400 3.7167 0.0505 133.1511 1.0684 9.3389 6.0209 15.2955 1.1866 1.4950 4.8505 24.8004 19.8462 23.0436 14.5910 31.9569 0.7743 39.3845 10.0566 0.7330 0.3634 58.9699 0.5361 22.1383 21.9532 47.3390 16.8078 2.6366 52.9094 6.0310 14.7602 4.8738 40.3490 69.9692 26.6315 46.7850 5.7142 82.9677 74.8291 22.0440 33.3028 44.2912 12.0763 0.8778 21.5012 11.5433 253.4730 34.6168 14.2761 5.3600 3.1932 2.8809 3.8842 62.3519 57.1721
temp: 298.150 k
press: 1.00000 atm
elementType: 17 17 7 7 7 7 6 6 6 6 6 6 6 6 6 6 6 6 6 1 1 1 1 1 1 1 1
symmnumber: 1
zpe: 487247.7 jmol-1
zpe.correction: 0.185583 hartree
zpe.thermalcorrener: 0.201054 hartree
zpe.thermalcorrenthalpy: 0.201998 hartree
zpe.thermalcorrgfe: 0.140922 hartree
zpe.sumelectzpe: -1638.009332 hartree
zpe.sumelectthermal: -1637.993861 hartree
zpe.sumelectthermalent: -1637.992917 hartree
zpe.sumelectthermalfe: -1638.053993 hartree
dipole: -1.2999 1.1459 -0.6206
dipole: 1.8407
quadrupole: -151.5996 -106.2144 -126.3270
quadrupole: 19.2359 -1.0555 -0.4615
quadrupole: -23.5526 21.8326 1.7200 19.2359 -1.0555 -0.4615
hfenergy: -1638.1949145 hartree
pointgroup: C01 [X(C13H8Cl2N4)]
dipole: 0.4868824 0.4811447 0.2364016 debye
polarizability: 366.4770582|-5.7009781|210.6396175|3.8736242|-1.1107163|71.7537825 unknown
InChI: InChI=1S/C13H8Cl2N4/c14-8-2-1-7(3-9(8)15)11-6-18-12-5-17-4-10(16)13(12)19-11/h1-6H,16H2
charge 0 multiplicity 1
27 atoms
Cl 4.073678 2.632853 -0.317761
Cl 6.06353 0.059643 0.198546
N  -0.7895 0.45724 0.092456
N  -1.98575 -2.133501 -0.19513
N  -4.985996 0.017758 -0.04251
N  -2.415553 2.710326 0.27665
C  -2.157284 0.304046 0.042562
C  -0.024579 -0.660711 0.00744
C  1.45162 -0.507102 0.061307
C  -2.776342 -0.992798 -0.093757
C  -3.004269 1.472915 0.139598
C  -0.656059 -1.956307 -0.146766
C  2.019921 0.782379 -0.116535
C  2.323017 -1.607449 0.289236
C  -4.200257 -1.079488 -0.130883
C  -4.404415 1.254221 0.088484
C  3.4109 0.964655 -0.076541
C  3.718413 -1.422066 0.330417
C  4.268927 -0.136791 0.144534
H  -0.049296 -2.861086 -0.254249
H  1.355761 1.63274 -0.288647
H  1.927788 -2.613119 0.457564
H  -4.68317 -2.055488 -0.234752
H  -5.097423 2.101592 0.156545
H  4.387479 -2.26794 0.51153
H  -1.397938 2.754895 0.318339
H  -2.968704 3.558586 0.354021
