program: Gaussian 09
title: 000276278
version: EM64L-G09RevD.01
frameworkgroup: C1[X(C16H10ClNO2)]
method: RPBEPBE
basis: SDD
operation: Freq
keyword: #p
keyword: freq=noraman
keyword: PBEPBE/SDD
title: #p freq=noraman PBEPBE/SDD
converged: YES YES NO NO
title: Mulliken charges:
elementType: Cl O O N C C C C C C C C C C C C C C C C H H H H H H H H H H
charge: -0.063382 -0.442397 -0.252333 -0.051482 0.280846 -0.112991 0.043430 0.184199 -0.367105 0.369325 -0.361221 -0.318730 -0.321785 -0.386701 -0.246168 -0.226743 0.117265 -0.105816 -0.227709 -0.237270 0.270463 0.299525 0.268424 0.306854 0.226190 0.234387 0.236831 0.233796 0.259489 0.390810
chargesum: 0.00000
title: Mulliken charges with hydrogens summed into heavy atoms:
elementType: Cl O O N C C C C C C C C C C C C C C C C
charge: -0.063382 -0.051587 -0.252333 -0.051482 0.280846 -0.112991 0.043430 0.184199 -0.096642 0.369325 -0.061696 -0.050306 -0.014931 -0.160511 -0.011782 0.010088 0.117265 -0.105816 0.006087 0.022219
polarizability: 3.34427264e+02 2.96145899e+01 2.47904819e+02 -2.58579187e-01 -1.08696386e+00 7.26612105e+01
1716.lowfreq: 0.0010 0.0010 0.0014 3.2967 4.5912 8.8711 12.9220 39.0564 60.3118
frequency: 12.7724 39.0541 60.3056 76.8309 102.0283 160.0209 163.9124 183.0112 191.6737 222.1173 276.9035 300.3323 329.5178 364.5419 377.4942 406.9633 412.1543 435.5954 497.9865 505.1272 520.1121 561.3987 566.7883 586.6437 610.5692 611.9331 648.2094 677.9058 694.1650 695.5557 736.9899 755.7882 788.7020 792.8915 799.6811 840.1562 880.6792 896.4825 903.4885 931.6605 945.2887 953.9097 979.0416 983.8016 985.0368 1009.5222 1024.2388 1066.1294 1072.1525 1075.9910 1092.9553 1135.5125 1170.8314 1183.1533 1207.9247 1251.2386 1271.7117 1289.1756 1300.3987 1324.0905 1351.3721 1377.3881 1384.4824 1407.0662 1430.1082 1445.1931 1473.6817 1508.8067 1535.6051 1572.2157 1578.4684 1603.4126 1618.4567 1638.1506 3136.3059 3142.3152 3153.0502 3163.1318 3172.2247 3176.6667 3178.9496 3187.1690 3201.4158 3530.2804
redmass: 7.3426 11.1536 5.4135 8.6992 4.7236 9.5684 5.9128 4.6850 4.2880 7.0586 7.3942 5.4290 6.2507 9.0137 8.0701 3.5520 7.0666 3.0990 4.2936 3.2013 6.4275 6.6373 3.2309 5.9097 4.7977 1.5912 6.4703 3.2213 6.4588 2.1066 3.8387 6.2342 1.5152 2.2508 2.1598 7.5825 7.2910 1.5221 1.4221 1.4690 1.5431 6.7557 1.3540 5.8890 1.3542 1.3224 2.2970 2.6927 2.9149 2.1700 1.5567 1.5757 1.1821 1.1202 1.5829 1.9847 1.4898 2.3561 1.8667 4.5382 3.6600 6.3966 4.5378 3.2807 2.7333 2.7394 2.8526 3.9201 7.3466 6.9394 6.9139 6.6169 6.1854 8.5723 1.0867 1.0868 1.0914 1.0928 1.0978 1.0948 1.0959 1.0958 1.0907 1.0642
irintensity: 0.2531 0.8912 1.6699 0.0081 0.0015 0.6487 0.5192 1.8338 1.8348 2.2315 0.2403 0.0649 0.6979 0.4012 7.6071 10.7946 5.4055 5.7879 2.0117 1.1818 2.0964 14.1324 17.5991 33.6432 44.8601 127.3881 13.8291 2.8439 15.7321 24.2772 13.2704 37.4380 93.3275 20.0748 31.5123 3.5401 7.4937 0.5588 1.0165 29.9253 2.0404 83.1599 0.2275 3.3793 4.7211 0.6604 3.4458 241.2109 89.3879 17.9778 4.4552 20.6005 4.0244 2.1759 5.3766 55.3398 1.4750 16.2692 6.9822 70.9588 54.3187 8.1235 12.1668 10.0568 43.6484 9.0126 21.3125 33.7252 61.9749 31.6312 116.2319 23.6577 5.1985 173.8903 6.0102 10.0329 16.3063 9.9405 13.3505 1.5860 13.2116 15.0056 0.2105 58.0872
temp: 298.150 k
press: 1.00000 atm
elementType: 17 8 8 7 6 6 6 6 6 6 6 6 6 6 6 6 6 6 6 6 1 1 1 1 1 1 1 1 1 1
symmnumber: 1
zpe: 567664.9 jmol-1
zpe.correction: 0.216212 hartree
zpe.thermalcorrener: 0.232172 hartree
zpe.thermalcorrenthalpy: 0.233117 hartree
zpe.thermalcorrgfe: 0.170552 hartree
zpe.sumelectzpe: -1279.628128 hartree
zpe.sumelectthermal: -1279.612168 hartree
zpe.sumelectthermalent: -1279.611224 hartree
zpe.sumelectthermalfe: -1279.673788 hartree
dipole: 1.4152 -2.2712 0.0770
dipole: 2.6772
quadrupole: -124.0169 -99.9913 -126.6234
quadrupole: 11.6754 -0.4252 -0.1485
quadrupole: -7.1397 16.8859 -9.7462 11.6754 -0.4252 -0.1485
hfenergy: -1279.8443403 hartree
pointgroup: C01 [X(C16H10Cl1N1O2)]
dipole: 0.4578514 0.9442363 -0.0904491 debye
polarizability: 339.7236615|-19.4357459|241.6212649|4.2374869|-12.7690539|73.6483672 unknown
InChI: InChI=1S/C16H10ClNO2/c17-11-5-3-4-10(8-11)15-9-13(16(19)20)12-6-1-2-7-14(12)18-15/h1-9,19H
charge 0 multiplicity 1
30 atoms
Cl -5.260118 -2.17438 0.116733
O  1.947381 3.450628 -0.223162
O  3.929972 2.267596 -0.134716
N  -0.03944 -1.143682 -0.031562
C  2.310471 -0.29566 -0.036124
C  1.324168 -1.365389 0.00413
C  -0.503808 0.127215 -0.108345
C  1.78288 1.050811 -0.112561
C  0.395539 1.243518 -0.14685
C  -1.985857 0.308088 -0.14679
C  3.699572 -0.644512 0.002785
C  1.758827 -2.728554 0.081981
C  -2.815481 -0.840404 -0.018558
C  -2.597519 1.580873 -0.309544
C  4.089439 -1.985694 0.077672
C  3.119011 -3.03563 0.117847
C  2.675157 2.248891 -0.154302
C  -4.208248 -0.690732 -0.052291
C  -4.003024 1.702139 -0.341501
C  -4.830769 0.564134 -0.211674
H  0.018007 2.264911 -0.197441
H  4.446219 0.151402 -0.027092
H  0.985151 -3.501427 0.109892
H  -2.340409 -1.817044 0.102126
H  -1.991608 2.484929 -0.41943
H  5.155644 -2.23596 0.106119
H  3.448025 -4.078669 0.176466
H  -4.463251 2.687436 -0.469691
H  -5.920777 0.649313 -0.234542
H  2.593046 4.206854 -0.247772
