program: Gaussian 09
title: 000270699
version: EM64L-G09RevD.01
frameworkgroup: C1[X(C12H13NO)]
method: RPBEPBE
basis: SDD
operation: Freq
keyword: #p
keyword: freq=noraman
keyword: PBEPBE/SDD
title: #p freq=noraman PBEPBE/SDD
converged: YES YES NO NO
title: Mulliken charges:
elementType: O N C C C C C C C C C C C C H H H H H H H H H H H H H
charge: -0.232491 -0.160702 0.127850 -0.376872 -0.426815 -0.542835 -0.391311 0.369281 0.164542 -0.503717 0.065428 -0.411403 -0.388353 -0.265492 0.209246 0.219425 0.210457 0.225027 0.216048 0.224501 0.220418 0.230614 0.238010 0.241521 0.231121 0.276651 0.229851
chargesum: 0.00000
title: Mulliken charges with hydrogens summed into heavy atoms:
elementType: O N C C C C C C C C C C C C
charge: -0.232491 -0.160702 0.127850 0.051799 0.008668 -0.091803 0.049238 0.369281 0.164542 -0.024186 0.065428 -0.180282 -0.111702 -0.035641
polarizability: 1.70891679e+02 -1.56805293e-01 1.63690825e+02 -1.47142957e+00 4.13516698e-01 7.59493456e+01
1716.lowfreq: -15.6726 -4.6917 -0.0008 -0.0005 0.0007 9.2952 72.9559 84.0952 138.9107
frequency: 72.9358 84.0616 138.9089 188.3031 208.5465 298.7780 303.6577 309.2018 372.7235 395.5855 418.3328 475.0470 492.0570 514.8326 532.3422 548.5266 573.9525 616.9802 672.2522 744.4645 760.8664 794.5210 828.6789 857.9369 880.6516 899.9483 927.5835 938.7808 985.9789 997.9590 1031.7810 1054.5176 1064.4042 1079.8300 1094.6948 1109.8876 1149.2735 1172.9802 1182.3727 1199.4176 1216.6586 1227.2141 1253.3142 1271.8656 1288.9781 1320.9287 1324.8404 1328.8111 1350.1916 1352.9406 1384.4244 1397.7389 1433.9415 1448.2194 1459.4069 1466.5306 1468.5013 1476.1840 1514.6760 1576.8795 1579.8863 1618.0771 2907.0905 2913.3979 2962.3966 2983.9607 3001.2444 3022.1028 3035.5143 3041.0723 3067.9448 3081.9908 3112.2353 3143.4640 3164.9590
redmass: 4.6106 2.5506 3.2264 3.8811 2.3843 2.3789 3.2862 3.7650 5.2852 3.4163 4.0508 4.6951 3.7594 2.7188 4.1626 3.3597 3.5595 2.9435 3.8856 3.4477 2.9409 1.6235 2.1979 2.1252 1.8105 2.4527 2.8468 1.3622 1.3480 2.2224 2.7897 1.9889 2.1649 1.7627 2.9661 2.0991 1.4921 1.2447 1.3222 1.3717 1.7200 1.7233 1.5541 1.5098 1.8859 1.6217 2.1983 1.5064 1.4486 1.4743 3.1499 2.6151 1.0898 1.7302 1.3715 1.1360 1.4695 1.1961 1.6964 7.9224 8.4835 6.9236 1.0692 1.0712 1.0659 1.0649 1.0643 1.0897 1.0927 1.0912 1.1040 1.0958 1.0891 1.0888 1.0989
irintensity: 2.7427 0.6872 8.0398 0.7915 2.3569 6.9037 4.8066 4.8204 4.9043 5.1356 4.8200 2.8661 1.6753 1.8572 3.5512 2.7280 4.7511 0.3404 1.0801 22.0812 16.5379 29.7609 13.6223 5.9921 3.5394 0.8593 11.8806 0.1864 1.9335 1.0501 9.8033 1.7282 4.5470 3.4613 30.2877 18.6773 0.9222 1.3726 20.7523 7.9365 49.4708 5.0188 8.1849 21.4707 81.8607 65.8924 44.7173 19.9490 19.3217 15.8406 20.1839 34.0016 19.8096 53.8160 7.4302 8.5633 33.3571 20.1335 98.6185 210.5864 75.8532 103.0860 25.2673 147.6820 35.5508 14.9681 14.7114 46.6660 40.8819 44.1222 46.0087 17.2718 16.5622 2.9117 23.0728
temp: 298.150 k
press: 1.00000 atm
elementType: 8 7 6 6 6 6 6 6 6 6 6 6 6 6 1 1 1 1 1 1 1 1 1 1 1 1 1
symmnumber: 1
zpe: 587193.8 jmol-1
zpe.correction: 0.223650 hartree
zpe.thermalcorrener: 0.234650 hartree
zpe.thermalcorrenthalpy: 0.235594 hartree
zpe.thermalcorrgfe: 0.187012 hartree
zpe.sumelectzpe: -594.055428 hartree
zpe.sumelectthermal: -594.044428 hartree
zpe.sumelectthermalent: -594.043484 hartree
zpe.sumelectthermalfe: -594.092066 hartree
dipole: 5.2830 -2.3922 -0.2848
dipole: 5.8063
quadrupole: -91.6914 -71.3562 -83.7805
quadrupole: 1.5339 -0.1695 0.6010
quadrupole: -9.4154 10.9199 -1.5045 1.5339 -0.1695 0.6010
hfenergy: -594.2790783 hartree
pointgroup: C01[X(C12H13N1O1)]
dipole: -2.0572791 -0.9861329 0.1164614 debye
polarizability: 170.8864546|0.3064391|163.6874078|-1.281464|-1.191792|75.9579866 unknown
InChI: InChI=1S/C12H13NO/c14-11-6-8-13-7-2-4-9-3-1-5-10(11)12(9)13/h1,3,5H,2,4,6-8H2
charge 0 multiplicity 1
27 atoms
O  3.451742 0.030319 -0.055981
N  -0.485814 -1.376813 0.061672
C  -0.264056 0.004653 0.036911
C  -1.848887 -1.917089 0.235864
C  -2.883793 -1.034785 -0.484323
C  -2.800017 0.409025 0.052835
C  0.636398 -2.258339 0.442707
C  -1.36636 0.926702 0.030362
C  1.080512 0.524898 0.022484
C  1.922013 -1.859286 -0.297638
C  2.250143 -0.378998 -0.080138
C  -1.101127 2.307676 0.023024
C  1.298197 1.929273 0.034102
C  0.221184 2.826024 0.036943
H  -2.108985 -1.992255 1.317218
H  -1.863184 -2.943255 -0.177327
H  -3.894736 -1.452776 -0.326607
H  -2.677483 -1.048882 -1.570903
H  0.358366 -3.299104 0.196428
H  0.808739 -2.207822 1.543242
H  -3.191674 0.431367 1.091133
H  -3.450455 1.079572 -0.538892
H  1.787752 -2.017895 -1.387455
H  2.779327 -2.471762 0.029222
H  -1.952521 3.000972 0.015248
H  2.338002 2.2736 0.023705
H  0.390721 3.907178 0.03896
