program: Gaussian 09
title: 000276292
version: EM64L-G09RevD.01
frameworkgroup: C1[X(C19H18N2O2)]
method: RPBEPBE
basis: SDD
operation: Freq
keyword: #p
keyword: freq=noraman
keyword: PBEPBE/SDD
title: #p freq=noraman PBEPBE/SDD
converged: YES YES NO NO
title: Mulliken charges:
elementType: O O N N C C C C C C C C C C C C C C C C C C C H H H H H H H H H H H H H H H H H H
charge: -0.262835 -0.260992 -0.148970 -0.087246 0.212468 0.153691 0.409873 -0.491387 0.229837 0.465836 0.139000 -0.348093 -0.354201 0.339735 -0.361403 -0.336557 -0.424703 -0.393450 -0.405895 -0.390926 -0.645890 -0.646454 -0.786012 0.290908 0.257551 0.259326 0.238673 0.238059 0.254749 0.226092 0.269893 0.220812 0.238235 0.219105 0.238641 0.238668 0.239295 0.218747 0.247721 0.250969 0.247128
chargesum: 0.00000
title: Mulliken charges with hydrogens summed into heavy atoms:
elementType: O O N N C C C C C C C C C C C C C C C C C C C
charge: -0.262835 -0.260992 -0.148970 -0.087246 0.212468 0.153691 0.409873 -0.200480 0.229837 0.465836 0.139000 -0.090542 -0.094874 0.339735 -0.122730 -0.098498 -0.169954 -0.167357 -0.136002 -0.170114 0.050090 0.050257 -0.040194
polarizability: 5.67330045e+02 1.05118117e+01 2.19824293e+02 5.70146649e+00 -3.40516671e+00 1.15566589e+02
1716.lowfreq: -130.9967 -5.3319 -3.4878 -0.0009 -0.0003 0.0007 1.3630 23.6552 26.9364
frequency: -130.9963 23.6255 26.8922 33.1712 61.4114 76.4122 94.5553 119.3421 127.8937 151.5801 161.4700 170.1808 186.6935 200.2335 232.0763 233.2502 256.2599 295.8294 314.5870 359.1870 373.6325 406.6813 428.5257 432.1650 433.8781 453.4454 478.4234 503.4659 518.7102 533.8510 543.1459 563.4640 565.6718 572.6180 628.2050 636.0103 697.7205 706.2483 739.2431 743.3795 763.0836 797.0065 809.1369 828.7297 834.9623 851.3982 875.7566 910.7194 919.8563 925.1189 940.0745 945.2662 968.3504 980.3062 990.2226 994.7277 1001.5580 1041.4217 1055.6698 1063.1966 1106.0599 1111.1013 1121.5423 1128.0219 1158.4297 1165.5163 1171.2483 1190.7423 1207.3811 1246.1868 1257.3362 1257.7551 1274.0994 1317.1115 1328.7043 1360.3578 1369.3163 1380.6206 1393.7110 1397.6594 1429.2673 1429.9773 1450.0091 1457.6274 1461.5626 1463.5273 1464.8966 1467.2250 1476.9230 1493.1152 1506.2945 1532.8081 1548.7864 1556.1447 1566.1954 1589.0449 1613.1979 1630.8280 1634.5530 2942.5360 2946.2037 2953.4442 2997.8611 3014.2280 3017.4692 3081.1821 3099.8589 3109.9315 3117.3782 3117.3999 3145.5947 3145.7802 3154.7500 3165.4471 3169.2995 3172.0941 3175.6535
redmass: 1.0273 4.7806 4.2667 4.4432 4.6692 2.3243 5.1787 2.2796 2.9287 4.1377 2.9967 3.5352 4.5819 1.1749 4.3877 4.3894 2.3939 3.7677 4.9974 3.9144 4.5314 5.1794 3.1747 4.0140 4.0693 4.6911 4.4273 4.3973 4.2630 3.1018 5.0989 4.3890 3.8950 4.1352 6.4823 6.3060 3.9013 5.1991 4.6590 3.9259 3.3661 5.9529 1.3140 1.6133 1.6777 3.6171 1.4691 3.1907 3.2588 2.1886 3.0417 1.3730 1.3413 1.4089 1.5167 2.9071 1.5768 1.4895 1.5042 2.3953 1.2377 1.3254 1.4026 1.5127 3.4117 1.7867 2.0377 1.3711 2.8225 1.6888 2.7841 1.8929 1.5735 1.6282 2.9090 2.1784 3.9363 7.8488 2.5658 1.2710 2.5079 1.7569 2.6845 1.4617 1.6101 1.0447 1.0402 1.3405 1.0459 1.1071 1.1316 2.8036 7.0152 10.3326 7.6010 6.3311 6.9408 7.6223 6.3914 1.0857 1.0369 1.0392 1.0373 1.0996 1.1027 1.0981 1.0965 1.0945 1.0985 1.0900 1.0910 1.0874 1.0881 1.0936 1.0952 1.0925 1.0976
irintensity: 0.0971 2.0900 2.4178 1.1609 0.1296 0.2920 1.6117 5.9327 1.0006 0.4449 1.6186 3.7168 0.3876 0.1722 7.9207 4.6843 0.3599 7.3873 2.3370 12.1083 3.1501 0.3842 1.5334 3.3640 1.2738 1.6914 2.1430 8.6374 8.3813 15.4698 14.7386 2.5155 14.0156 6.4452 3.1621 0.9805 3.5501 1.1082 3.1299 11.7362 0.4558 25.9401 8.7727 23.1345 79.1746 10.8234 38.9418 32.3610 27.7125 15.5512 34.5873 2.4886 0.1062 9.0543 23.5325 0.0653 0.2148 8.1364 25.8171 0.9390 0.0336 1.1187 28.1717 19.9475 192.3190 1.8759 13.3415 106.4288 38.3247 5.8916 27.7259 46.9283 2.7975 81.1053 261.8821 79.0003 260.0307 30.2281 2.8674 38.0862 62.4678 72.1443 41.0622 5.5535 132.0124 18.2538 0.0840 11.4587 23.0358 7.5734 59.9181 446.4506 215.7811 130.1397 192.5276 438.4050 46.1296 223.6310 298.3412 42.5927 100.7979 169.2112 14.3810 8.3884 72.0821 9.6657 4.0474 50.4748 4.6100 11.0788 10.8273 2.0122 3.2088 21.7394 20.3382 5.5097 7.5591
temp: 298.150 k
press: 1.00000 atm
elementType: 8 8 7 7 6 6 6 6 6 6 6 6 6 6 6 6 6 6 6 6 6 6 6 1 1 1 1 1 1 1 1 1 1 1 1 1 1 1 1 1 1
symmnumber: 1
zpe: 848276.1 jmol-1
zpe.correction: 0.323091 hartree
zpe.thermalcorrener: 0.343455 hartree
zpe.thermalcorrenthalpy: 0.344399 hartree
zpe.thermalcorrgfe: 0.272481 hartree
zpe.sumelectzpe: -993.134910 hartree
zpe.sumelectthermal: -993.114546 hartree
zpe.sumelectthermalent: -993.113602 hartree
zpe.sumelectthermalfe: -993.185520 hartree
dipole: 4.4798 -2.1014 -1.0192
dipole: 5.0520
quadrupole: -53.8247 -137.5330 -138.4673
quadrupole: 11.3174 4.5246 -5.8363
quadrupole: 56.1169 -27.5913 -28.5256 11.3174 4.5246 -5.8363
hfenergy: -993.4580013 hartree
pointgroup: C01 [X(C19H18N2O2)]
dipole: 1.7748906 -0.893313 -0.0492458 debye
polarizability: 566.8800799|17.0086253|203.5499392|6.0651059|-38.1594778|132.2909068 unknown
InChI: InChI=1S/C19H18N2O2/c1-13-10-18(22)17-11-15(6-9-19(17)23-13)20-12-14-4-7-16(8-5-14)21(2)3/h4-12H,1-3H3
charge 0 multiplicity 1
41 atoms
O  -5.310822 -1.04883 0.050194
O  -3.503254 2.684283 -0.539725
N  6.786403 0.243097 0.063271
N  0.331854 -0.868881 0.270107
C  -3.246945 0.306233 -0.115265
C  -3.902313 -0.936586 0.081891
C  5.400059 0.165206 -0.061093
C  -1.832905 0.343543 -0.067534
C  -1.079425 -0.834168 0.169054
C  2.536901 -0.005618 -0.314169
C  -4.045095 1.542602 -0.358756
C  -3.179437 -2.123031 0.337976
C  -1.780079 -2.063384 0.391537
C  -6.076576 0.100698 -0.180549
C  4.695346 0.948505 -1.034322
C  4.627228 -0.705298 0.783209
C  -5.495514 1.332265 -0.375871
C  3.300764 0.85696 -1.150093
C  3.23663 -0.7832 0.654863
C  1.086081 -0.072577 -0.459358
C  7.555454 1.142964 -0.807789
C  7.485539 -0.562489 1.074913
C  -7.55124 -0.206668 -0.180039
H  -1.354735 1.321904 -0.189661
H  -3.720767 -3.059983 0.497342
H  -1.187221 -2.958622 0.602138
H  5.238856 1.627144 -1.697145
H  5.123563 -1.319429 1.539843
H  -6.134794 2.201909 -0.551014
H  2.785621 1.468269 -1.902486
H  2.651833 -1.446966 1.300358
H  0.650356 0.578726 -1.248066
H  7.426516 0.885368 -1.878195
H  8.626474 1.060285 -0.566389
H  7.255465 2.201718 -0.671811
H  7.331002 -1.648195 0.913556
H  7.147008 -0.316923 2.101495
H  8.566805 -0.362706 1.018166
H  -8.070879 0.354511 0.616658
H  -7.7140 -1.283111 -0.013572
H  -8.012857 0.074778 -1.142864
