program: Gaussian 09
title: 000276254
version: EM64L-G09RevD.01
frameworkgroup: C1[X(C14H10N2O5)]
method: RPBEPBE
basis: SDD
operation: Freq
keyword: #p
keyword: freq=noraman
keyword: PBEPBE/SDD
title: #p freq=noraman PBEPBE/SDD
converged: YES YES YES YES
title: Mulliken charges:
elementType: O O O O O N N C C C C C C C C C C C C C C H H H H H H H H H H
charge: -0.200586 -0.220941 -0.174227 -0.208370 -0.211958 0.016079 0.016067 -0.692429 0.308079 0.284913 0.326026 0.171824 -0.573236 -0.556565 -0.583729 -0.349368 0.288575 0.205018 0.414136 -0.389236 -0.536338 0.260593 0.260593 0.268078 0.304931 0.299458 0.257619 0.290016 0.229456 0.266062 0.229457
chargesum: 0.00000
title: Mulliken charges with hydrogens summed into heavy atoms:
elementType: O O O O O N N C C C C C C C C C C C C C C
charge: -0.200586 -0.220941 -0.174227 -0.208370 -0.211958 0.016079 0.016067 -0.171243 0.308079 0.284913 0.326026 0.171824 -0.305158 -0.251634 -0.284271 -0.091749 0.288575 0.205018 0.414136 -0.099220 0.188637
polarizability: 3.90565303e+02 -7.18395722e+00 2.09815119e+02 -6.52454223e-03 -1.30377359e-02 7.65252076e+01
1716.lowfreq: -29.6409 -2.1306 -0.0008 -0.0001 0.0006 4.4403 8.2138 40.3423 48.9553
frequency: -29.6386 40.3299 48.9539 72.8404 95.0048 107.0910 144.6438 182.8418 183.0264 201.4978 216.6008 240.2922 265.2633 279.3302 307.6369 355.4533 381.2194 381.7572 432.3540 443.9007 448.0521 460.1152 512.6053 529.5565 574.2826 606.2949 610.3150 639.1495 670.8163 671.3266 701.9137 713.5640 738.6589 739.4842 764.9310 768.9922 790.1280 852.5293 856.7160 894.5972 913.0791 921.4076 949.9851 974.0109 992.6072 994.3306 1043.0668 1072.8291 1106.8167 1121.9070 1138.8668 1143.8437 1152.3386 1180.5034 1185.8130 1200.4668 1212.0154 1228.8741 1247.5273 1265.8178 1301.0490 1356.0216 1359.8717 1377.9124 1402.3401 1419.1363 1426.7732 1438.8145 1455.6939 1458.2944 1470.0973 1473.6218 1488.4874 1578.4940 1591.2075 1621.9524 1634.1838 2974.2602 2989.6827 3035.1939 3071.2328 3143.6807 3150.9096 3165.2609 3172.1920 3175.5698 3186.5247
redmass: 13.3078 7.3099 9.2407 5.3772 8.7371 4.7666 5.4454 5.7039 3.1530 5.7561 2.0591 9.6562 1.4110 3.7088 7.1417 10.2358 5.5472 6.4593 3.2240 2.9964 8.8510 5.8529 3.6954 6.0483 6.3463 5.2738 4.8749 8.1876 7.0979 5.6337 5.0451 5.9010 8.8393 4.6883 8.1106 3.5536 6.1193 1.5305 1.4689 4.2174 1.6013 7.6896 1.5042 1.9161 1.3671 4.1580 5.6092 2.0955 1.2551 1.7958 1.1537 1.8645 1.4400 2.5066 11.6624 2.5141 2.6710 5.1248 1.3432 1.9747 2.6615 9.3479 10.0053 5.4657 4.3656 1.5317 1.3192 3.6507 2.4492 2.3421 1.3174 1.0503 3.8210 9.2872 7.8722 7.7471 7.9234 1.0324 1.0612 1.0992 1.1049 1.1003 1.0909 1.0909 1.0928 1.0921 1.0951
irintensity: 0.1171 1.5706 1.6733 0.9992 4.2369 3.6892 0.8591 0.7382 0.4448 3.0290 0.0001 0.4835 0.5877 16.1078 1.4891 1.2049 2.5891 2.1611 5.6645 0.0392 6.4823 18.4476 0.0069 0.9131 2.5021 1.1522 2.0213 6.6268 17.0374 0.0367 25.6442 2.4362 33.4239 0.4885 4.2053 0.2945 9.1922 43.0948 18.3225 10.6247 2.3710 16.8793 11.0884 32.7345 0.3556 47.8555 60.9372 18.8567 0.0774 8.0975 0.0175 23.5203 28.7458 0.7515 490.7505 392.4807 236.8338 59.0388 5.8164 137.1172 86.1289 77.6228 78.5524 13.0314 29.8382 86.9358 20.8569 9.4748 4.1779 175.6156 25.4783 17.0388 5.1903 32.9840 22.5689 127.3663 154.4880 57.1957 5.8240 2.9690 35.3614 12.8292 4.5992 5.2565 1.7588 6.7189 1.5459
temp: 298.150 k
press: 1.00000 atm
elementType: 8 8 8 8 8 7 7 6 6 6 6 6 6 6 6 6 6 6 6 6 6 1 1 1 1 1 1 1 1 1 1
symmnumber: 1
zpe: 573541.4 jmol-1
zpe.correction: 0.218450 hartree
zpe.thermalcorrener: 0.234849 hartree
zpe.thermalcorrenthalpy: 0.235793 hartree
zpe.thermalcorrgfe: 0.173919 hartree
zpe.sumelectzpe: -1023.472717 hartree
zpe.sumelectthermal: -1023.456318 hartree
zpe.sumelectthermalent: -1023.455374 hartree
zpe.sumelectthermalfe: -1023.517248 hartree
dipole: 3.1498 -6.3377 0.0006
dipole: 7.0773
quadrupole: -176.1227 -109.9095 -119.5155
quadrupole: -28.1879 0.0050 -0.0008
quadrupole: -40.9401 25.2731 15.6671 -28.1879 0.0050 -0.0008
hfenergy: -1023.6911671 hartree
pointgroup: C01 [X(C14H10N2O5)]
dipole: -1.1938186 2.5155014 0.0002391 debye
polarizability: 390.2454749|-10.4554257|210.1349473|0.0067598|0.0129173|76.5252076 unknown
InChI: InChI=1S/C14H10N2O5/c1-21-14-6-9-4-8-5-10(15(17)18)2-3-11(8)12(9)7-13(14)16(19)20/h2-3,5-7H,4H2,1H3
charge 0 multiplicity 1
31 atoms
O  -4.413485 1.19135 0.000038
O  -3.471241 -2.912025 -0.000284
O  -5.105318 -1.329837 -0.000376
O  5.977227 -1.194324 0.00001
O  5.832282 1.08307 0.000253
N  -3.865901 -1.674755 -0.000252
N  5.297542 -0.095003 0.000094
C  0.618893 2.002985 0.000208
C  -0.687115 1.220171 0.000102
C  -0.415255 -0.182917 -0.000035
C  1.67245 0.901204 0.000116
C  1.040281 -0.383926 -0.000027
C  -2.001801 1.696068 0.000126
C  -1.475091 -1.103175 -0.000147
C  3.067279 1.013182 0.000157
C  1.813421 -1.568148 -0.000133
C  -2.807698 -0.632359 -0.000129
C  -3.094537 0.7791 0.000011
C  3.820393 -0.187074 0.00005
C  3.217901 -1.468286 -0.000095
C  -4.701892 2.635851 0.000203
H  0.706108 2.65944 0.887702
H  0.706142 2.659621 -0.88715
H  -2.194833 2.772015 0.000234
H  -1.321311 -2.185331 -0.00025
H  3.589893 1.973491 0.000267
H  1.335783 -2.553012 -0.000245
H  3.858561 -2.353731 -0.000173
H  -4.299664 3.122499 0.908318
H  -5.798957 2.691249 0.000204
H  -4.299656 3.122705 -0.907799
