program: Gaussian 09
title: 000276250
version: EM64L-G09RevD.01
frameworkgroup: C1[X(C10H10F3NO3)]
method: RPBEPBE
basis: SDD
operation: Freq
keyword: #p
keyword: freq=noraman
keyword: PBEPBE/SDD
title: #p freq=noraman PBEPBE/SDD
converged: YES YES NO NO
title: Mulliken charges:
elementType: F F F O O O N C C C C C C C C C C H H H H H H H H H H
charge: -0.133950 -0.131308 -0.180120 -0.257830 -0.425517 -0.282331 -0.444336 0.406953 0.373555 0.162393 -0.398430 -0.457143 -0.387640 -0.245340 0.160242 -0.683831 0.310904 0.223096 0.276942 0.258335 0.357801 0.215911 0.215695 0.211526 0.232836 0.232951 0.388635
chargesum: 0.00000
title: Mulliken charges with hydrogens summed into heavy atoms:
elementType: F F F O O O N C C C C C C C C C C
charge: -0.133950 -0.131308 -0.180120 -0.257830 -0.036882 -0.282331 -0.086535 0.406953 0.373555 0.162393 -0.175334 -0.180200 -0.129305 0.186265 0.160242 -0.006517 0.310904
polarizability: 2.41237821e+02 1.23925233e+01 1.29725954e+02 -1.46223560e+00 -1.83037344e-01 6.89532368e+01
1716.lowfreq: -4.3186 -3.2646 -0.0006 0.0003 0.0009 3.4942 16.5749 26.2298 37.7185
frequency: 16.3615 26.1724 37.6982 84.0365 91.9656 113.9203 145.6838 164.0408 210.0337 218.4476 239.4707 254.6522 273.7814 295.8587 339.5855 373.5981 383.8042 423.2820 440.8810 466.9094 495.2705 508.3439 538.5582 583.9321 617.3122 640.3366 666.0609 702.4869 711.5005 733.4529 775.1647 798.9873 822.6650 848.4938 855.1853 875.8147 896.2117 926.4475 976.0942 1010.9248 1032.9776 1036.8573 1082.0919 1112.8801 1121.7941 1136.0951 1183.5302 1198.6411 1243.1595 1265.8599 1276.5060 1284.6308 1359.9224 1370.5845 1400.7208 1401.7036 1461.2240 1472.5434 1476.1672 1484.7831 1497.2509 1540.2757 1585.6203 1617.9011 1640.5040 2899.2523 2965.8917 2998.9548 3026.2462 3096.3777 3107.8807 3114.9110 3184.0806 3186.2819 3481.1800
redmass: 9.6506 11.4095 5.6318 4.1777 5.4195 1.8359 5.8880 5.0444 6.6549 6.7462 1.3003 7.2998 8.6060 7.8626 4.8847 5.9781 6.8325 9.3909 8.8157 3.4428 6.9791 7.3025 6.8123 7.1288 4.3142 13.2509 7.1846 2.9421 5.8456 1.2872 5.8086 1.4641 1.1746 3.7894 1.7216 3.4170 1.1398 1.3339 3.4061 11.6798 2.6465 12.2609 8.1583 2.0216 1.9570 1.4435 1.8360 2.9182 2.2889 1.1382 2.0509 3.1825 1.9683 1.3276 4.0216 1.5084 1.0397 1.9535 1.2022 1.2751 1.7044 2.1643 4.0166 6.5547 5.0091 1.0763 1.0556 1.0363 1.1077 1.0989 1.1015 1.0903 1.0939 1.0920 1.0762
irintensity: 0.0808 0.1998 0.0807 2.2498 1.4834 7.3337 2.4439 0.9136 1.1319 2.0503 0.3463 0.6801 1.6719 2.4900 3.4514 3.5054 7.2008 0.5412 6.1631 4.8636 9.2216 14.3240 21.6483 32.7124 10.9568 11.7497 0.6821 0.3750 0.2722 42.9029 11.1367 45.6458 44.2212 74.0290 55.7221 26.5710 79.3731 0.4409 35.3675 194.6949 60.2181 274.1109 353.5696 0.8346 12.3027 5.2506 135.9581 268.6860 108.3332 0.7984 164.5981 34.8026 82.7126 14.7447 31.4187 48.6408 12.4715 28.2754 46.1897 60.9329 28.5448 69.4203 42.8993 107.6868 441.2404 381.0047 30.2338 25.1506 29.3812 26.2291 34.3089 12.3399 1.8226 3.3305 50.8561
temp: 298.150 k
press: 1.00000 atm
elementType: 9 9 9 8 8 8 7 6 6 6 6 6 6 6 6 6 6 1 1 1 1 1 1 1 1 1 1
symmnumber: 1
zpe: 502005.2 jmol-1
zpe.correction: 0.191204 hartree
zpe.thermalcorrener: 0.207436 hartree
zpe.thermalcorrenthalpy: 0.208381 hartree
zpe.thermalcorrgfe: 0.145079 hartree
zpe.sumelectzpe: -965.748903 hartree
zpe.sumelectthermal: -965.732671 hartree
zpe.sumelectthermalent: -965.731726 hartree
zpe.sumelectthermalfe: -965.795028 hartree
dipole: 3.7733 2.6049 -0.1740
dipole: 4.5884
quadrupole: -94.1405 -98.8494 -100.5368
quadrupole: -10.9186 0.7758 -0.0092
quadrupole: 3.7017 -1.0071 -2.6946 -10.9186 0.7758 -0.0092
hfenergy: -965.940107 hartree
pointgroup: C01 [X(C10H10F3N1O3)]
dipole: 1.427531 -0.9918692 0.4869299 debye
polarizability: 239.1939879|-19.9730527|119.5443017|1.2739942|-24.4424865|81.1787224 unknown
InChI: InChI=1S/C10H10F3NO3/c1-2-17-6-3-4-7(8(15)5-6)14-9(16)10(11,12)13/h3-5,14-15H,2H2,1H3
charge 0 multiplicity 1
27 atoms
F  -4.570707 1.32325 0.862496
F  -4.758111 0.129426 -1.051634
F  -4.048938 -0.891067 0.853642
O  4.05339 -0.717912 0.080985
O  0.229708 2.084334 -0.900084
O  -2.322336 1.707351 -1.012878
N  -1.579893 -0.164531 0.239118
C  -0.147174 -0.180923 0.115948
C  2.67917 -0.480139 0.062088
C  0.671015 0.870851 -0.417608
C  0.48443 -1.357009 0.612998
C  2.078862 0.692643 -0.4383
C  1.871337 -1.521695 0.596601
C  4.947974 0.329499 -0.463685
C  -2.513832 0.679781 -0.280369
C  6.375272 -0.18601 -0.30959
C  -3.968466 0.318288 0.089527
H  -0.13984 -2.163445 1.02002
H  2.659067 1.518539 -0.855551
H  2.347897 -2.426529 0.980576
H  -1.955358 -0.945662 0.789935
H  4.692587 0.507208 -1.527895
H  4.79217 1.270156 0.102083
H  7.089896 0.559436 -0.702994
H  6.611511 -0.37042 0.752115
H  6.512383 -1.128914 -0.865624
H  -0.786412 2.109997 -1.03332
