program: Gaussian 09
title: 000276239
version: EM64L-G09RevD.01
frameworkgroup: C1[X(C14H7NO5)]
method: RPBEPBE
basis: SDD
operation: Freq
keyword: #p
keyword: freq=noraman
keyword: PBEPBE/SDD
title: #p freq=noraman PBEPBE/SDD
converged: YES YES NO NO
title: Mulliken charges:
elementType: O O O O O N C C C C C C C C C C C C C C H H H H H H H
charge: -0.127277 -0.392332 -0.225183 -0.204750 -0.195224 0.020785 0.296652 0.280914 0.036799 0.258680 -0.235658 0.233839 -0.356333 -0.404812 -0.558930 0.409973 -0.384746 -0.377188 -0.206999 0.084603 0.256991 0.255846 0.331766 0.293333 0.272922 0.244982 0.391348
chargesum: 0.00000
title: Mulliken charges with hydrogens summed into heavy atoms:
elementType: O O O O O N C C C C C C C C C C C C C C
charge: -0.127277 -0.000984 -0.225183 -0.204750 -0.195224 0.020785 0.296652 0.280914 0.036799 0.258680 -0.235658 0.233839 -0.099343 -0.148965 -0.227164 0.409973 -0.111824 -0.083856 0.037982 0.084603
polarizability: 3.17849053e+02 1.16569222e+01 2.01661774e+02 -6.39602090e+00 2.75709619e+00 7.03846925e+01
1716.lowfreq: -6.3342 -4.6636 -0.0003 0.0005 0.0006 2.6565 39.8783 51.3175 57.5456
frequency: 39.8756 51.3076 57.5409 74.7795 106.4454 150.1233 161.9496 167.7191 177.2335 234.0051 279.5734 288.9431 318.6303 331.2291 384.5311 428.6026 445.9886 472.5566 492.9102 518.6452 537.7280 564.8394 580.6548 609.3937 616.5951 657.0988 660.2502 675.4360 704.2102 726.8777 739.7884 765.3201 813.2554 827.1387 837.8916 841.8398 870.7978 935.8742 938.9033 967.6689 996.4629 999.0481 1017.1436 1050.0868 1065.4136 1078.9314 1123.6092 1143.1102 1170.1617 1171.9797 1206.6427 1218.3375 1251.2082 1286.9767 1329.3545 1359.1348 1379.4161 1389.8681 1430.4569 1441.8452 1465.9749 1480.6799 1586.2835 1601.8512 1603.3850 1613.1627 1636.2592 1644.9747 3141.1205 3152.1177 3156.2691 3173.5040 3180.4453 3183.8815 3522.8372
redmass: 13.7217 12.4330 10.3696 7.0986 7.8767 6.1621 5.4809 6.5242 6.1536 8.1913 9.7916 7.6491 6.3416 8.1202 5.4151 3.8344 4.3284 5.6670 6.6078 4.6367 3.0834 3.8181 3.4174 2.5607 5.3105 7.3954 5.2559 6.3532 5.0239 4.7705 8.7596 2.2058 8.0918 2.1052 5.7502 4.3888 1.6624 2.1249 2.5806 1.5417 1.3912 1.3852 5.2865 2.5051 2.4150 2.1636 2.2830 2.2584 2.3170 1.4789 4.2953 2.1050 1.5669 2.0955 3.1816 7.2528 5.4742 4.4648 2.8166 4.2060 4.1241 4.1441 8.6189 8.3909 7.1651 7.9862 10.0011 10.8263 1.0881 1.0909 1.0922 1.0989 1.0933 1.0950 1.0642
irintensity: 0.7594 0.3584 0.7591 2.1711 1.1546 0.7574 0.8910 1.4510 6.0752 0.5704 2.0366 1.8526 0.0343 3.6703 2.5704 1.9017 3.0577 9.6812 2.0209 13.1949 14.6786 39.0374 21.7899 64.7028 33.8882 4.8179 8.3094 11.0696 22.5014 45.3134 13.3456 23.6812 1.6049 25.0450 9.8302 34.6557 11.8010 17.5967 20.7522 17.3265 1.3298 0.9536 110.8313 86.4726 53.3502 20.6746 23.1244 43.4821 40.8951 25.4899 309.4276 191.3875 0.6189 7.1039 67.6917 64.2753 10.2800 47.5085 9.1373 5.8843 23.6674 12.4319 52.9799 16.5566 60.8494 212.3298 158.4519 124.7354 3.0673 2.6982 7.0409 12.1673 6.0681 3.1863 46.6854
temp: 298.150 k
press: 1.00000 atm
elementType: 8 8 8 8 8 7 6 6 6 6 6 6 6 6 6 6 6 6 6 6 1 1 1 1 1 1 1
symmnumber: 1
zpe: 474355.7 jmol-1
zpe.correction: 0.180673 hartree
zpe.thermalcorrener: 0.196250 hartree
zpe.thermalcorrenthalpy: 0.197194 hartree
zpe.thermalcorrgfe: 0.136610 hartree
zpe.sumelectzpe: -967.133893 hartree
zpe.sumelectthermal: -967.118315 hartree
zpe.sumelectthermalent: -967.117371 hartree
zpe.sumelectthermalfe: -967.177956 hartree
dipole: 3.5099 5.6292 1.3617
dipole: 6.7721
quadrupole: -141.8484 -100.1079 -115.4656
quadrupole: -3.3126 6.5565 -3.4086
quadrupole: -22.7078 19.0327 3.6751 -3.3126 6.5565 -3.4086
hfenergy: -967.3145653 hartree
pointgroup: C01 [X(C14H7N1O5)]
dipole: 1.3814571 2.2503724 0.3552271 debye
polarizability: 317.0492307|11.6473806|201.6178208|-14.7928699|-5.7380117|71.2284681 unknown
InChI: InChI=1S/C14H7NO5/c16-13-11-6-7(15(19)20)4-5-8(11)9-2-1-3-10(12(9)13)14(17)18/h1-6,17H
charge 0 multiplicity 1
27 atoms
O  0.775472 -2.285767 -0.212528
O  3.403661 -2.026144 0.992252
O  4.865342 -1.387534 -0.700686
O  -5.503746 0.203541 0.218149
O  -4.637239 -1.907951 0.188159
N  -4.511857 -0.623359 0.176819
C  0.878147 1.317667 -0.075083
C  -0.577613 1.040841 -0.007182
C  1.589523 0.076996 -0.057081
C  -0.767131 -0.372282 0.006161
C  0.576631 -1.053118 -0.075243
C  2.99954 0.065811 -0.100508
C  -1.687338 1.905944 0.040348
C  1.559938 2.544074 -0.16177
C  -2.038553 -0.951117 0.060407
C  -3.13991 -0.0616 0.112349
C  3.684479 1.306226 -0.230409
C  -2.983844 1.344329 0.102955
C  2.974503 2.526097 -0.254399
C  3.842212 -1.171705 -0.011156
H  -1.566374 2.99359 0.029507
H  1.018454 3.495681 -0.172635
H  -2.189071 -2.033877 0.062678
H  -3.878245 1.971927 0.142718
H  4.776663 1.297764 -0.301336
H  3.526263 3.467641 -0.341279
H  3.941892 -2.863474 0.986592
