program: Gaussian 09
title: 000276236
version: EM64L-G09RevD.01
frameworkgroup: C1[X(C14H7ClO3)]
method: RPBEPBE
basis: SDD
operation: Freq
keyword: #p
keyword: freq=noraman
keyword: PBEPBE/SDD
title: #p freq=noraman PBEPBE/SDD
converged: YES YES NO YES
title: Mulliken charges:
elementType: Cl O O O C C C C C C C C C C C C C C H H H H H H H
charge: -0.039998 -0.148407 -0.442228 -0.269597 0.196742 0.293174 0.205018 0.185927 -0.320611 0.135618 -0.343442 -0.420579 -0.401800 -0.309483 -0.226353 -0.225620 -0.098280 0.121468 0.332036 0.289477 0.303887 0.285886 0.245804 0.260772 0.390591
chargesum: 0.00000
title: Mulliken charges with hydrogens summed into heavy atoms:
elementType: Cl O O O C C C C C C C C C C C C C C
charge: -0.039998 -0.148407 -0.051637 -0.269597 0.196742 0.293174 0.205018 0.185927 -0.320611 0.135618 -0.011405 -0.131102 -0.097913 -0.023597 0.019451 0.035151 -0.098280 0.121468
polarizability: 2.88976231e+02 -1.28520455e+01 1.99914376e+02 -9.65415352e-03 -8.35797622e-03 6.16236685e+01
1716.lowfreq: -6.3775 -0.0011 -0.0004 0.0021 3.5492 8.3189 36.4525 57.6326 76.5090
frequency: 36.4520 57.6300 76.5066 133.8284 147.3701 180.2733 192.9681 199.1413 246.7498 294.9105 330.3075 333.3610 347.2228 415.4834 421.9996 453.4116 480.7006 506.9441 559.0820 563.6884 577.2844 601.0424 608.0919 667.0620 672.7143 684.1718 729.4589 777.8917 779.5111 803.1372 835.9652 851.9409 865.4888 922.2156 943.9352 970.8756 993.8446 1008.2751 1008.8196 1033.3790 1062.7311 1088.8143 1107.4614 1160.6500 1172.0606 1191.9973 1208.2117 1252.8246 1269.2266 1315.3431 1365.2336 1382.7170 1415.1966 1432.1583 1456.6083 1469.3372 1567.6393 1584.1622 1599.7343 1612.9537 1633.8546 1640.3595 3147.4933 3164.5636 3165.3023 3169.3003 3188.1793 3196.4292 3532.9528
redmass: 11.1328 7.0837 8.4999 11.9275 6.1684 4.8345 5.7989 10.3631 11.4804 9.4676 5.8633 6.7871 7.2309 3.7077 9.8858 3.6757 4.6981 7.2332 2.7897 7.2695 6.6106 1.3499 4.9008 8.0105 4.5981 6.3790 4.9203 1.9108 6.8957 4.1457 7.8517 1.8335 1.7103 1.5981 7.2213 1.4533 6.7376 1.3874 1.3356 3.2944 1.9839 1.8396 2.4664 1.9618 1.7134 2.0644 1.9989 2.4493 1.4003 2.8269 6.1441 3.1758 3.2572 3.0671 3.1513 4.0688 7.8944 8.2670 7.9324 7.2300 10.4334 9.2007 1.0884 1.0947 1.0914 1.0938 1.0960 1.0950 1.0642
irintensity: 0.8347 1.9470 0.6961 0.0561 0.3277 0.1752 3.7403 2.1243 0.1728 4.2504 0.7280 7.4803 2.6297 0.4574 15.0742 20.9011 1.4639 9.8820 2.1885 6.7092 5.9954 124.6345 45.7776 33.6177 20.1341 12.3257 37.3696 62.3618 41.8592 3.0582 1.8869 3.4661 30.2178 15.7978 44.0268 1.2038 1.1068 3.1595 2.5298 350.9496 5.0804 51.0588 69.4294 61.9471 52.7388 32.3273 17.2584 52.0668 2.5217 63.9187 3.9371 29.2286 25.4056 138.6727 53.1274 12.7068 107.3323 78.7073 16.1039 18.6160 35.9039 275.6644 1.0212 9.7814 2.0034 1.1764 4.9147 26.0088 67.8176
temp: 298.150 k
press: 1.00000 atm
elementType: 17 8 8 8 6 6 6 6 6 6 6 6 6 6 6 6 6 6 1 1 1 1 1 1 1
symmnumber: 1
zpe: 447801.9 jmol-1
zpe.correction: 0.170559 hartree
zpe.thermalcorrener: 0.184540 hartree
zpe.thermalcorrenthalpy: 0.185484 hartree
zpe.thermalcorrgfe: 0.128733 hartree
zpe.sumelectzpe: -1222.231231 hartree
zpe.sumelectthermal: -1222.217250 hartree
zpe.sumelectthermalent: -1222.216306 hartree
zpe.sumelectthermalfe: -1222.273057 hartree
dipole: -3.9962 -1.9423 0.0024
dipole: 4.4432
quadrupole: -98.8672 -108.8830 -111.4015
quadrupole: -1.7866 0.0039 -0.0007
quadrupole: 7.5167 -2.4991 -5.0176 -1.7866 0.0039 -0.0007
hfenergy: -1222.4017901 hartree
pointgroup: C01 [X(C14H7Cl1O3)]
dipole: 1.5501459 0.8004516 -0.110132 debye
dipolederiv: -1.076817 0.1033502 0.0511615 0.0733753 -0.1154789 -0.0019933 0.0520259 -0.0035776 -0.0609617 -0.5312206 -0.1694458 0.0184943 -0.0909423 -1.0183652 0.0294435 0.0157464 0.0337399 -0.2969607 -1.3110423 -0.5699697 0.0674148 -0.563973 -0.5451605 0.0345914 0.0674331 0.0349768 -0.4298682 -0.73655 0.0833551 0.0196531 0.0379566 -0.9516366 0.019925 0.021327 0.0176573 -0.3197025 0.7088514 0.2434603 -0.046085 -0.2417501 0.1608691 0.007816 -0.0295723 -0.0181266 0.0127884 -0.253552 -0.1219233 0.0161801 -0.0013248 0.0789002 -0.0036421 0.0119133 0.0027515 -0.0309398 -0.760145 -0.0606928 0.0448439 0.2899523 -0.2848122 -0.004639 0.0328838 0.0141203 0.0325735 -0.3102962 0.2973325 0.0092959 0.4346403 -0.3666789 -0.0092284 0.0046295 -0.0017423 0.0505406 1.2327087 0.0454598 -0.0620075 -0.0844173 1.248048 -0.0341331 -0.0574075 -0.041224 0.1125273 -0.3247471 -0.1134975 0.022141 -0.3642587 -0.5956969 0.0408109 0.0310249 0.0271727 0.011216 -0.044026 0.1918459 -0.0091176 -0.1053758 -0.0529564 0.0043829 0.0011208 -0.0116175 -0.0932115 0.3496106 0.0477541 -0.0254665 -0.1175955 0.1754399 -0.0028827 -0.0197672 -0.0117189 -0.0905811 -0.2846989 0.0070032 0.0108407 0.236283 0.030351 -0.0164045 0.002959 -0.0041066 -0.0774099 -0.0516932 -0.0886798 0.0009374 0.2417744 0.1065391 -0.0199973 -0.01069 -0.0022508 -0.0902057 -0.098622 -0.1493427 0.0012217 -0.3557941 -0.1717707 0.0192561 0.0081758 0.0081512 -0.1719218 -0.3765818 -0.1272281 0.0193344 -0.1645968 0.0376416 0.0043185 0.0205276 0.0022411 -0.0976649 1.5255097 -0.1631115 -0.079987 -0.117751 0.0766256 0.0013558 -0.0812708 0.0037796 -0.0651567 1.550124 0.3319511 -0.0821041 0.6896432 1.7194923 -0.0885566 -0.0945991 -0.0693289 0.2463135 0.2201279 -0.0006356 -0.0033984 0.0330853 0.0878787 0.0005409 -0.0046361 0.0023412 0.1583975 0.1181126 -0.034453 0.0033091 0.0218692 -0.0142727 0.0047467 0.0013695 0.0077097 0.1572098 0.0822186 -0.0192645 0.0052326 -0.0588082 0.052669 0.0070671 0.0065533 0.0049551 0.1664973 0.0194775 -0.0372692 0.0086756 -0.0364116 0.1203017 0.0032167 0.0086837 0.0033298 0.1552109 -0.0647875 0.0845032 0.009405 0.0752919 0.0408619 0.0001677 0.0098643 -0.0003639 0.1629122 0.0503363 0.0592057 0.0038537 0.0673405 0.0027581 0.0016887 0.0035292 0.0021342 0.1589552 0.3677023 0.1602924 -0.0038286 0.1017872 0.1784526 0.0021491 -0.0018241 -0.0010033 0.3994423 unknown
polarizability: 288.9119079|-10.9766068|199.1977997|-11.8645907|-4.1324476|62.4045687 unknown
InChI: InChI=1S/C14H7ClO3/c15-7-4-5-8-11(6-7)13(16)9-2-1-3-10(12(8)9)14(17)18/h1-6,17H
charge 0 multiplicity 1
25 atoms
Cl -5.312298 0.573054 0.236644
O  -0.958683 -3.263624 0.133351
O  3.49325 2.483401 -0.303934
O  1.237536 2.941534 -0.198377
C  0.759597 -0.083526 -0.067595
C  -0.682212 0.338019 -0.004126
C  0.787686 -1.517023 -0.019552
C  -1.488974 -0.842604 0.079445
C  -0.610017 -2.053377 0.073487
C  2.00975 0.597789 -0.158675
C  -1.325431 1.594144 -0.012056
C  1.964837 -2.272265 -0.056818
C  -2.88774 -0.810004 0.153689
C  3.2120 -0.182018 -0.196398
C  3.201054 -1.586563 -0.147077
C  -2.742031 1.649281 0.062339
C  -3.497796 0.4627 0.143267
C  2.14982 2.078396 -0.217347
H  -0.742338 2.513268 -0.074408
H  1.908495 -3.365082 -0.016254
H  -3.467765 -1.735066 0.216492
H  4.16121 0.354236 -0.266489
H  4.144348 -2.14015 -0.179046
H  -3.250059 2.618174 0.056713
H  3.51706 3.477008 -0.33958
