program: Gaussian 09
title: 000276237
version: EM64L-G09RevD.01
frameworkgroup: C1[X(C14H6Cl2O2)]
method: RPBEPBE
basis: SDD
operation: Freq
keyword: #p
keyword: freq=noraman
keyword: PBEPBE/SDD
title: #p freq=noraman PBEPBE/SDD
converged: YES YES NO NO
title: Mulliken charges:
elementType: Cl Cl O O C C C C C C C C C C C C C C H H H H H H
charge: -0.033262 -0.064755 -0.126525 -0.084559 0.307673 0.290278 0.015132 0.248851 -0.261053 0.359204 -0.407803 -0.374492 -0.393388 -0.375233 -0.203135 -0.199361 -0.106121 -0.179788 0.255661 0.253826 0.305980 0.266049 0.244242 0.262578
chargesum: 0.00000
title: Mulliken charges with hydrogens summed into heavy atoms:
elementType: Cl Cl O O C C C C C C C C C C C C C C
charge: -0.033262 -0.064755 -0.126525 -0.084559 0.307673 0.290278 0.015132 0.248851 -0.261053 0.359204 -0.152142 -0.120666 -0.087408 -0.109184 0.041107 0.063217 -0.106121 -0.179788
polarizability: 2.84683568e+02 -1.56917913e+01 1.93016078e+02 1.00531507e+01 5.07508205e+00 8.40213166e+01
1716.lowfreq: -0.0013 0.0008 0.0021 2.1520 4.6164 8.8347 31.3601 51.2386 70.1306
frequency: 31.3264 51.2251 70.1271 90.4385 134.7257 148.7035 166.5303 178.6272 236.6952 266.3066 300.0722 311.3657 329.9928 359.2086 415.8117 429.1157 449.7587 476.7490 511.2625 546.2975 564.4523 591.6774 634.8340 654.5014 673.7314 684.0892 737.8979 755.1692 784.4458 814.9006 826.4935 848.1659 882.6762 922.1265 922.8844 926.2921 961.5176 990.7750 1043.7022 1057.6323 1078.3402 1115.7434 1150.2789 1176.2901 1187.1910 1227.4742 1252.9346 1285.5306 1354.6877 1376.4970 1418.5185 1430.8560 1457.1311 1469.9025 1588.7169 1594.6883 1600.8241 1606.8280 1638.7358 1720.7575 3140.9879 3145.7006 3155.6403 3168.8877 3172.4934 3173.1182
redmass: 18.5797 12.8778 7.3571 14.0329 6.8129 7.3585 8.3172 6.5152 9.6470 6.8229 8.7299 7.1321 7.3656 8.6421 4.6310 6.3980 4.4198 8.0112 6.0809 4.5265 7.0549 5.8837 8.3479 5.5778 6.9458 5.2128 5.7758 2.2620 7.3543 1.7224 3.0358 2.0144 6.6137 3.5930 1.5383 1.9059 1.4052 1.3803 3.4890 2.1551 2.3162 2.8396 2.0809 1.7257 2.0285 2.1179 1.4846 2.3469 6.2533 3.5058 2.7789 3.4417 3.8976 3.4286 8.3527 8.3603 7.1080 8.1481 11.5589 13.1672 1.0876 1.0900 1.0925 1.0938 1.0983 1.0969
irintensity: 0.2346 0.4434 0.0792 0.4971 0.1261 0.2801 0.4576 1.2443 1.5023 4.3757 7.2281 1.7933 2.7297 3.2240 13.4658 7.2110 11.8262 5.1350 38.1404 7.1743 3.0587 4.3348 6.1766 22.7633 15.9880 14.9021 136.3424 9.7269 44.5664 38.0746 31.3000 2.4655 64.3094 12.3033 9.7576 3.1765 0.6339 1.0283 8.7871 12.9219 17.2360 33.8605 10.5360 75.0581 80.5012 31.8644 37.8293 6.6624 0.2964 19.8338 2.0423 84.7163 16.5563 13.1061 124.4863 1.2199 0.9319 35.0364 105.5342 263.7484 4.0785 3.2150 5.3316 0.6778 8.1946 8.5296
temp: 298.150 k
press: 1.00000 atm
elementType: 17 17 8 8 6 6 6 6 6 6 6 6 6 6 6 6 6 6 1 1 1 1 1 1
symmnumber: 1
zpe: 409547.9 jmol-1
zpe.correction: 0.155989 hartree
zpe.thermalcorrener: 0.170523 hartree
zpe.thermalcorrenthalpy: 0.171467 hartree
zpe.thermalcorrgfe: 0.112732 hartree
zpe.sumelectzpe: -1606.460251 hartree
zpe.sumelectthermal: -1606.445717 hartree
zpe.sumelectthermalent: -1606.444772 hartree
zpe.sumelectthermalfe: -1606.503507 hartree
dipole: 2.0570 6.9194 1.1191
dipole: 7.3049
quadrupole: -121.8074 -107.3518 -120.9987
quadrupole: -8.4348 -2.3288 0.4048
quadrupole: -5.0881 9.3675 -4.2794 -8.4348 -2.3288 0.4048
hfenergy: -1606.6162394 hartree
pointgroup: C01 [X(C14H6Cl2O2)]
dipole: -0.7897281 2.7632791 0.0171592 debye
dipolederiv: -0.8854493 -0.2915618 -0.0421674 -0.3699946 -0.2418594 -0.0185982 -0.0490609 -0.0175837 -0.053807 -0.2225059 0.0720566 -0.0202623 0.2036515 -0.4188722 -0.3730897 0.1661589 -0.4192204 -0.8169618 -0.6006582 0.1077142 -0.0115342 0.1183325 -0.85259 0.0653216 -0.0374864 0.0621018 -0.2530003 -0.7141832 0.1578921 -0.4793427 0.2819882 -0.3739787 0.0675017 -0.200096 -0.1143279 -0.8473827 0.4071131 0.2309673 0.0282088 0.1299136 0.0344398 -0.0101707 0.0164621 0.0013281 0.0330405 0.1148829 -0.1283442 0.0036449 -0.0051229 -0.0476722 -0.0068336 0.0150847 0.0037598 -0.0068065 -0.5215034 -0.3569834 -0.0277056 -0.1946591 -0.3076856 -0.0131906 0.0642532 -0.0929821 -0.0037306 -0.6946534 0.1368448 -0.0359801 0.1178724 -0.0895737 0.0115768 -0.0228187 0.0068743 0.0205836 1.3704489 -0.0170247 0.0594378 0.0015446 1.0885762 -0.0876268 0.0538334 -0.0356778 0.1362658 0.151674 0.1812206 -0.0468353 0.1956491 -0.0970732 -0.0209452 -0.0419125 0.010095 -0.0759192 -0.2737839 -0.1768831 0.0160514 -0.2137035 0.0174787 0.0002083 -0.0122308 -0.0098881 -0.1437863 -0.1629142 0.0974485 -0.0009874 -0.0647662 0.1276605 0.0024976 -0.0060704 0.0074407 -0.1305228 -0.2308572 -0.1360214 -0.0096331 0.0670788 0.0576439 0.0035402 -0.0184975 -0.0069599 -0.0614042 -0.0972035 0.1058487 0.043015 -0.0881252 -0.1451511 -0.0351065 -0.0383707 0.0454058 -0.1392687 0.0852902 0.0597078 -0.0073842 0.1429953 0.1439222 0.0260398 0.0169444 0.0170215 -0.0983897 -0.1417623 -0.1716029 -0.0023338 -0.2340076 -0.1388747 -0.0106892 -0.0011345 -0.0118516 -0.0814951 1.2344513 0.4674382 0.0711945 0.603353 0.2739767 0.0331866 0.0756759 0.0291176 -0.0778865 0.9599495 -0.3833395 0.5005222 -0.7160499 0.9040773 0.3829267 0.0440338 0.5568313 1.6627332 0.039888 0.1060182 -0.0019436 0.0667754 -0.0106998 -0.0012762 -0.0055275 0.0005835 0.1529449 0.0836401 -0.0450778 -0.0059609 -0.0038944 -0.0709632 -0.0017509 -0.0053569 -0.0035323 0.153581 0.1132886 0.0121136 -0.0022009 -0.0252593 0.0341358 -0.0024459 0.0017032 -0.0004616 0.1635554 -0.0394653 -0.0178288 -0.0099707 0.0097405 0.0984131 0.0067564 0.0012862 -0.0174564 0.1514406 0.0372109 -0.0671265 -0.0092019 -0.075851 -0.0571816 -0.0200698 -0.0068118 -0.0129589 0.1548886 -0.0128976 0.0565237 -0.0086305 0.0525389 0.0718513 0.0022376 -0.010061 0.0023414 0.1613278 unknown
polarizability: 284.9626133|13.2094391|191.5159601|11.8695132|12.7781624|85.2423888 unknown
InChI: InChI=1S/C14H6Cl2O2/c15-7-4-5-8-9-2-1-3-10(14(16)18)12(9)13(17)11(8)6-7/h1-6H
charge 0 multiplicity 1
24 atoms
Cl -5.360905 -1.25301 -0.266731
Cl 3.16916 -1.977297 -1.568399
O  0.357559 -2.355281 0.149407
O  4.103703 -1.408775 0.930626
C  0.173016 1.242942 0.05996
C  -1.260776 0.858756 -0.025295
C  0.962478 0.054577 0.063175
C  -1.346774 -0.563736 -0.041118
C  0.0403 -1.142353 0.049561
C  2.366333 0.119329 0.1387
C  0.782394 2.507276 0.14246
C  -2.43217 1.633093 -0.083582
C  -2.573528 -1.238678 -0.110072
C  2.982609 1.398015 0.260318
C  2.195288 2.570903 0.25181
C  -3.686107 0.971438 -0.159294
C  -3.737869 -0.439275 -0.171126
C  3.269199 -1.071656 0.096894
H  0.189267 3.427426 0.135813
H  -2.401633 2.727454 -0.07167
H  -2.620673 -2.331365 -0.115871
H  4.071915 1.466736 0.340476
H  2.690111 3.54437 0.332238
H  -4.614395 1.548214 -0.206682
