program: Gaussian 09
title: 000276233
version: EM64L-G09RevD.01
frameworkgroup: C1[X(C13H9N3O3)]
method: RPBEPBE
basis: SDD
operation: Freq
keyword: #p
keyword: freq=noraman
keyword: PBEPBE/SDD
title: #p freq=noraman PBEPBE/SDD
converged: NO NO NO NO
title: Mulliken charges:
elementType: O O O N N N C C C C C C C C C C C C C H H H H H H H H H
charge: -0.247878 -0.218647 -0.270847 -0.447480 0.022798 -0.663104 0.333321 0.313028 0.372215 0.109793 -0.595089 -0.628879 -0.013784 0.214218 0.389843 -0.364844 -0.344358 -0.232755 -0.241451 0.280226 0.334954 0.230941 0.234748 0.277697 0.234773 0.239047 0.313897 0.367619
chargesum: 0.00000
title: Mulliken charges with hydrogens summed into heavy atoms:
elementType: O O O N N N C C C C C C C C C C C C C
charge: -0.247878 -0.218647 -0.270847 -0.112527 0.022798 0.018412 0.333321 0.313028 0.372215 0.109793 -0.314863 -0.397939 -0.013784 0.214218 0.389843 -0.130095 -0.066661 0.002018 -0.002404
polarizability: 3.32300670e+02 -1.85885096e+00 2.14091559e+02 -1.39794364e-02 -4.48362907e-03 6.49996166e+01
1716.lowfreq: -10.1131 -8.8511 -4.1381 -0.0002 0.0006 0.0008 46.7623 67.3210 94.7572
frequency: 46.7132 67.3200 94.7558 133.2333 141.3090 148.1656 208.9797 268.0600 271.4988 293.0147 332.0509 348.1142 360.5919 414.2435 425.9031 441.1191 468.5048 490.6617 501.1822 529.0468 532.6594 595.7247 621.3011 624.8449 653.5192 694.3298 697.3165 707.0543 715.8583 740.3476 748.5970 749.6871 783.1644 785.6989 795.3791 837.6285 849.5973 893.7686 935.4908 981.4475 987.6814 1007.3506 1036.4172 1046.5344 1073.0895 1095.5958 1137.5060 1179.3505 1190.5058 1225.7572 1244.7959 1277.9851 1290.6094 1302.1963 1329.8013 1349.6568 1383.7963 1394.6611 1425.9860 1446.6998 1471.4661 1494.9448 1533.3442 1550.8463 1574.9617 1588.3361 1615.1045 1630.3379 1651.1100 3129.9865 3137.3890 3150.3964 3161.1784 3173.9398 3183.2760 3397.8536 3510.3388 3647.4325
redmass: 7.9039 6.9839 6.9356 5.7791 7.4345 5.3902 5.6466 4.7422 7.4212 9.5275 7.3401 4.6316 4.6717 7.4936 3.4598 2.9974 7.2036 1.2378 8.6939 3.3107 5.5204 8.1364 5.8066 3.9638 2.7065 6.4136 4.8394 6.1271 2.8322 1.5249 1.2525 7.8337 1.8858 6.3186 2.5501 5.4391 1.8173 1.5387 1.4340 1.3781 3.7246 1.3426 2.2813 2.9368 2.4174 2.6953 2.0359 1.1200 5.5679 1.5375 2.1740 1.4528 3.7398 2.7002 4.0423 4.4137 2.3900 7.5967 3.6799 3.4917 2.6090 4.5873 3.0695 4.4559 3.2027 2.2045 5.9098 5.3995 7.3603 1.0913 1.0859 1.0892 1.0950 1.1006 1.0902 1.0553 1.0765 1.0947
irintensity: 7.0215 0.0855 1.6387 0.1834 3.2628 0.8655 0.0251 2.7829 3.9928 2.1570 8.3590 7.4176 1.0903 1.2213 6.5714 15.0326 3.0949 122.3205 7.4658 7.1725 6.0259 6.3124 9.9173 2.3932 0.8937 1.6386 1.1748 4.0841 35.9312 129.9595 89.0076 3.2036 55.1192 0.4020 2.2418 2.4177 70.4547 0.0871 19.6508 3.1643 1.0156 0.2626 49.0678 20.8274 11.7198 1.4445 11.7198 22.7984 591.5139 26.5751 75.2904 1.0690 117.4702 133.3290 134.0002 12.2956 21.3469 53.9010 7.5084 9.1387 60.9316 0.8286 10.2283 94.3304 38.6148 174.2597 142.3565 376.1747 469.7513 11.0625 2.5599 5.5005 10.1727 24.1898 2.6456 105.0473 38.0900 64.5042
temp: 298.150 k
press: 1.00000 atm
elementType: 8 8 8 7 7 7 6 6 6 6 6 6 6 6 6 6 6 6 6 1 1 1 1 1 1 1 1 1
symmnumber: 1
zpe: 532075.6 jmol-1
zpe.correction: 0.202657 hartree
zpe.thermalcorrener: 0.217038 hartree
zpe.thermalcorrenthalpy: 0.217982 hartree
zpe.thermalcorrgfe: 0.161318 hartree
zpe.sumelectzpe: -889.387774 hartree
zpe.sumelectthermal: -889.373393 hartree
zpe.sumelectthermalent: -889.372449 hartree
zpe.sumelectthermalfe: -889.429113 hartree
dipole: -0.3391 -2.5940 0.0045
dipole: 2.6161
quadrupole: -122.5552 -99.5094 -112.5417
quadrupole: -34.4519 0.0178 0.0070
quadrupole: -11.0198 12.0261 -1.0063 -34.4519 0.0178 0.0070
hfenergy: -889.5904308 hartree
pointgroup: C01 [X(C13H9N3O3)]
dipole: 0.1228664 1.0218901 0.0017702 debye
polarizability: 332.3264284|-0.6401207|214.0658003|0.0139325|0.0046275|64.9996166 unknown
InChI: InChI=1S/C13H9N3O3/c14-10-6-11-9(5-12(10)16(18)19)7-3-1-2-4-8(7)13(17)15-11/h1-6,15H,14H2
charge 0 multiplicity 1
28 atoms
O  3.284912 2.559413 -0.0004
O  -3.321238 -2.489424 -0.001304
O  -4.765442 -0.727085 -0.001512
N  1.005661 2.153137 -0.000237
N  -3.545508 -1.214432 0.000399
N  -3.831865 1.73352 0.000134
C  0.041044 -0.090787 0.000045
C  1.403054 -0.649438 0.000031
C  -0.130966 1.342079 -0.000084
C  2.526685 0.237935 -0.000127
C  -1.126287 -0.871096 0.000186
C  -1.409557 1.927778 -0.000067
C  2.344031 1.709053 -0.000281
C  -2.416317 -0.296497 0.00024
C  -2.594123 1.140552 0.000082
C  1.663479 -2.049578 0.000169
C  3.852385 -0.264249 -0.000146
C  2.980236 -2.539857 0.000149
C  4.08503 -1.648381 -0.000008
H  -1.082492 -1.96251 0.0003
H  0.895748 3.172315 -0.00033
H  -1.503416 3.020121 -0.000165
H  0.834865 -2.763743 0.000295
H  4.673265 0.460342 -0.000273
H  3.152771 -3.621501 0.00026
H  5.107558 -2.038525 -0.000021
H  -3.917793 2.746623 0.000053
H  -4.651918 1.114035 0.000312
