program: Gaussian 09
title: 000276231
version: EM64L-G09RevD.01
frameworkgroup: C1[X(C13H7N3O5)]
method: RPBEPBE
basis: SDD
operation: Freq
keyword: #p
keyword: freq=noraman
keyword: PBEPBE/SDD
title: #p freq=noraman PBEPBE/SDD
converged: NO YES NO YES
title: Mulliken charges:
elementType: O O O O O N N N C C C C C C C C C C C C C H H H H H H H
charge: -0.230483 -0.198558 -0.186686 -0.192053 -0.197744 -0.446070 0.022269 0.022630 0.357011 0.260272 0.131498 0.340714 -0.001921 -0.347651 -0.335618 -0.499240 -0.561520 0.418119 0.440789 -0.395246 -0.436590 0.350424 0.237632 0.235336 0.330330 0.294689 0.294275 0.293393
chargesum: 0.00000
title: Mulliken charges with hydrogens summed into heavy atoms:
elementType: O O O O O N N N C C C C C C C C C C C C C
charge: -0.230483 -0.198558 -0.186686 -0.192053 -0.197744 -0.095646 0.022269 0.022630 0.357011 0.260272 0.131498 0.340714 -0.001921 -0.110020 -0.100282 -0.168909 -0.266832 0.418119 0.440789 -0.100971 -0.143197
polarizability: 3.79101717e+02 -3.50899861e+00 2.04060616e+02 -2.60399394e-03 -1.14273134e-02 6.57210621e+01
1716.lowfreq: -4.2862 -0.0010 -0.0005 -0.0003 2.3118 9.6257 35.9003 49.5938 58.0031
frequency: 35.8992 49.5931 57.9992 90.8966 98.7569 107.6643 157.4225 180.2497 211.1692 216.8656 259.9049 298.1222 316.0497 339.1898 371.1053 428.4054 440.2427 453.5798 487.9637 499.8009 515.9108 520.1990 559.1892 562.1691 606.4428 640.0166 647.6961 688.0129 699.2755 711.7229 715.5553 729.9537 738.2679 758.6074 783.9529 795.5206 845.7735 861.1044 868.5571 920.6296 936.6250 981.6439 983.9198 992.9489 1000.0357 1067.5002 1087.6940 1117.4602 1139.5784 1149.2131 1204.3377 1209.1440 1245.3783 1253.4473 1270.2207 1280.7028 1313.8093 1360.1688 1371.7703 1382.1406 1400.5713 1416.1709 1432.1885 1457.2318 1481.2654 1504.0411 1568.9228 1598.4487 1611.2850 1626.0340 1638.4471 3162.1923 3165.1262 3170.8978 3178.0859 3189.0255 3196.0267 3512.6023
redmass: 10.9452 12.6262 13.3596 5.5330 7.5757 11.9620 5.6222 11.0898 7.3907 12.0520 4.8170 9.6477 9.4218 5.0391 10.8568 3.2263 7.6156 4.0465 10.0824 8.2439 6.8080 3.6957 7.2547 4.7794 5.7245 3.1301 7.7103 7.3998 4.0698 3.8610 7.1685 2.4829 10.5646 2.6037 8.6878 2.6263 1.4383 2.2209 7.1431 1.5695 4.2543 1.3900 1.4473 7.4280 1.3574 1.8875 1.8975 5.9724 1.6446 1.3280 8.3015 6.8546 1.9758 1.5881 2.3573 4.2139 1.9100 2.7493 9.9765 7.6912 9.4725 5.0698 5.3142 2.4291 4.6541 3.1655 8.5915 7.5483 6.6705 7.5458 5.5749 1.0900 1.0924 1.0874 1.0926 1.0963 1.0959 1.0768
irintensity: 3.0785 0.0374 1.2793 0.2374 2.5354 4.3755 0.6502 0.8161 3.3854 0.7701 5.9900 4.8389 0.0130 0.1649 4.2130 6.9172 6.2690 1.8323 1.4368 3.4898 2.2576 1.2128 3.1289 1.5707 7.2990 0.6811 2.2695 14.6596 0.0116 68.7873 17.9808 9.6910 11.8982 46.6254 36.5227 15.4408 48.3168 8.6910 7.6223 49.0403 13.2918 0.2111 20.3176 1.3178 0.5884 17.7647 47.1422 10.2447 16.9064 39.4507 871.2318 31.1320 10.3651 24.2289 34.8891 26.3529 17.4470 8.8407 59.1181 109.4544 83.6957 50.5000 16.9335 6.7076 26.6835 16.3146 17.2313 3.0452 56.7560 31.3822 403.0558 0.0178 4.8302 9.2873 13.3772 4.3628 2.6236 52.6146
temp: 298.150 k
press: 1.00000 atm
elementType: 8 8 8 8 8 7 7 7 6 6 6 6 6 6 6 6 6 6 6 6 6 1 1 1 1 1 1 1
symmnumber: 1
zpe: 490024.7 jmol-1
zpe.correction: 0.186641 hartree
zpe.thermalcorrener: 0.202633 hartree
zpe.thermalcorrenthalpy: 0.203578 hartree
zpe.thermalcorrgfe: 0.141967 hartree
zpe.sumelectzpe: -1038.395795 hartree
zpe.sumelectthermal: -1038.379802 hartree
zpe.sumelectthermalent: -1038.378858 hartree
zpe.sumelectthermalfe: -1038.440469 hartree
dipole: 2.0118 -2.8806 0.0083
dipole: 3.5136
quadrupole: -184.1921 -117.6631 -118.6446
quadrupole: 8.0128 0.0079 0.0083
quadrupole: -44.0255 22.5034 21.5220 8.0128 0.0079 0.0083
hfenergy: -1038.5824358 hartree
pointgroup: C01 [X(C13H7N3O5)]
dipole: -0.7928852 -1.1323357 -0.0032628 debye
polarizability: 379.1100167|3.2954834|204.052316|-0.0025901|0.0114305|65.7210621 unknown
InChI: InChI=1S/C13H7N3O5/c17-13-11-5-7(15(18)19)1-3-9(11)10-4-2-8(16(20)21)6-12(10)14-13/h1-6,14H
charge 0 multiplicity 1
28 atoms
O  1.262092 3.17998 0.001335
O  5.586066 -1.579699 0.001377
O  5.576042 0.703562 0.001064
O  -5.771212 -1.348348 0.001672
O  -5.645984 0.930981 0.002056
N  -0.721141 1.972399 -0.000651
N  4.979658 -0.439045 0.000997
N  -5.107327 -0.24237 0.000534
C  0.665774 -0.497302 -0.000862
C  -0.804427 -0.477724 -0.000977
C  1.38481 0.743219 -0.000846
C  -1.473325 0.792384 -0.000514
C  0.68192 2.056309 -0.002119
C  1.419047 -1.709703 -0.000388
C  -1.605117 -1.654526 -0.000866
C  2.797961 0.766078 -0.000107
C  -2.887082 0.867574 0.000067
C  3.493155 -0.450224 0.000372
C  -3.623017 -0.326058 0.00003
C  2.819255 -1.696169 0.000216
C  -3.005141 -1.599035 -0.00046
H  -1.207159 2.875099 0.000121
H  0.908941 -2.676243 -0.00036
H  -1.125576 -2.636776 -0.00103
H  3.323773 1.72514 -0.000179
H  -3.416165 1.825436 0.00046
H  3.404401 -2.619287 0.000634
H  -3.623122 -2.499348 -0.000374
