program: Gaussian 09
title: 000276222
version: EM64L-G09RevD.01
frameworkgroup: C1[X(C9H10O4S)]
method: RPBEPBE
basis: SDD
operation: Freq
keyword: #p
keyword: freq=noraman
keyword: PBEPBE/SDD
title: #p freq=noraman PBEPBE/SDD
converged: YES YES NO NO
title: Mulliken charges:
elementType: S O O O O C C C C C C C C C H H H H H H H H H H
charge: 0.249523 -0.424904 -0.437745 -0.195366 -0.203795 -0.062864 -0.689670 -0.353412 -0.305947 0.271391 -0.339599 0.186297 -0.237892 -0.274144 0.231057 0.335591 0.282761 0.220695 0.227500 0.287571 0.352596 0.267556 0.269479 0.343320
chargesum: 0.00000
title: Mulliken charges with hydrogens summed into heavy atoms:
elementType: S O O O O C C C C C C C C C
charge: 0.249523 -0.072308 -0.094425 -0.195366 -0.203795 0.168194 -0.071318 0.094783 -0.305947 0.271391 -0.052028 0.186297 0.029665 -0.004666
polarizability: 1.98248609e+02 -3.40399569e+01 1.28124646e+02 1.58688967e+01 4.08291216e+00 8.55897788e+01
1716.lowfreq: -8.5441 -0.0025 -0.0020 -0.0017 4.0539 9.7391 27.8157 41.9353 50.4364
frequency: 27.5204 41.8433 50.3614 85.9517 111.3294 151.9692 175.8423 210.4880 226.3527 264.4817 277.3942 306.2854 322.0307 370.7535 389.7840 401.1454 410.1940 451.7134 459.1283 529.6638 538.0527 589.2806 624.2508 648.6432 760.1858 775.4014 821.7142 832.6446 837.6770 873.7091 906.8251 947.7321 971.3222 980.3604 995.3955 1041.1571 1080.5269 1090.2252 1124.4831 1196.3675 1204.7376 1222.0375 1272.5234 1282.0821 1308.3280 1312.7065 1332.3883 1350.7042 1363.4389 1371.3452 1425.8870 1465.9691 1520.9799 1549.3488 1559.5705 1630.7321 2992.8469 3015.2885 3050.2124 3072.1688 3146.4961 3147.7365 3148.1851 3171.7569 3526.7370 3568.7669
redmass: 6.9290 6.0879 6.7449 6.9226 5.5975 6.3793 3.0236 8.3424 6.4688 4.4612 3.7277 1.1587 8.5949 2.0389 1.3224 4.1153 5.4078 4.4094 8.4446 3.9375 5.3614 2.7641 6.9836 4.5191 4.8165 3.4103 2.7042 2.6019 3.4340 2.1921 1.5567 2.2277 3.8550 4.0427 1.3019 1.8758 1.9188 1.5794 1.0943 1.5884 1.4405 1.2628 2.2096 1.5541 1.9536 1.2528 1.3675 2.0281 1.2201 1.2026 1.0903 1.0768 11.0303 8.0199 9.2818 7.0595 1.0607 1.0843 1.0613 1.1044 1.0870 1.1042 1.0928 1.1012 1.0654 1.0666
irintensity: 1.1532 1.1493 0.9811 8.6819 5.2709 3.7821 7.8343 2.4149 4.0609 6.5128 11.8596 148.0234 1.9595 1.2407 269.9232 9.5156 19.8571 3.7608 1.0804 1.4590 7.8523 2.1336 2.3999 18.9319 5.3321 0.1759 13.3355 10.0860 17.8225 10.2578 61.1112 62.1343 81.1949 78.4019 0.2128 17.8211 28.5874 45.0583 12.2135 6.5105 9.9242 7.2712 55.5701 43.8558 27.0028 3.3327 37.2026 7.0677 5.5116 12.7752 30.6418 7.6850 27.3222 196.6127 245.5054 3.9907 38.8545 16.8854 12.4361 27.4804 0.6212 12.7039 3.0101 7.5533 3.1713 10.0267
temp: 298.150 k
press: 1.00000 atm
elementType: 16 8 8 8 8 6 6 6 6 6 6 6 6 6 1 1 1 1 1 1 1 1 1 1
symmnumber: 1
zpe: 460042.9 jmol-1
zpe.correction: 0.175221 hartree
zpe.thermalcorrener: 0.189684 hartree
zpe.thermalcorrenthalpy: 0.190628 hartree
zpe.thermalcorrgfe: 0.132475 hartree
zpe.sumelectzpe: -1046.803353 hartree
zpe.sumelectthermal: -1046.788890 hartree
zpe.sumelectthermalent: -1046.787945 hartree
zpe.sumelectthermalfe: -1046.846099 hartree
dipole: -1.8281 1.2395 1.4643
dipole: 2.6500
quadrupole: -83.5810 -96.4039 -93.8445
quadrupole: 6.1889 -4.5777 1.0593
quadrupole: 7.6954 -5.1274 -2.5681 6.1889 -4.5777 1.0593
hfenergy: -1046.9785738 hartree
pointgroup: C01 [X(C9H10O4S1)]
dipole: -0.7354 0.1489934 -0.7238546 debye
dipolederiv: -0.4867762 -0.1105773 -0.0566186 -0.2739623 -0.2394544 -0.0911045 0.0984954 0.0009328 0.0151897 -0.7303992 -0.0421446 0.1229942 0.1553678 -0.6465523 0.0377403 0.1874344 -0.0340915 -0.1963087 -0.9167668 -0.1426492 0.2008713 -0.1558947 -0.483153 -0.1168377 0.3098864 -0.1517081 -0.2681743 -0.5852639 -0.1582688 -0.0795919 -0.0944644 -0.492125 -0.2105234 -0.016154 -0.2080596 -0.5757301 -0.8460596 -0.2263937 -0.099839 -0.4316801 -0.5387462 -0.1336886 -0.3136442 -0.2075592 -0.5775723 0.407315 0.0630197 -0.0579544 -0.1742276 0.3812257 -0.0917704 -0.1098991 0.03089 0.1431026 0.0680645 -0.0063617 0.1791072 0.1946388 0.0066988 0.024345 0.370888 -0.0002622 0.0831083 0.6256366 0.139576 -0.0070177 0.14664 0.3141121 0.0068864 -0.0791891 0.0291402 0.1731397 0.8585542 0.3956778 0.048339 0.5116589 0.134853 -0.0509439 0.0986344 -0.036746 -0.4084476 0.7180898 0.2332842 -0.0026352 0.0674166 0.4494919 0.2261332 -0.0606862 0.2365684 0.7536096 -1.0795588 -0.3543198 -0.0079482 -0.4115258 -0.239822 0.0605307 -0.0331666 0.0461732 0.0455579 1.3043505 0.4144118 -0.0229945 0.6171775 0.5081489 0.1230968 -0.1713311 0.1071116 0.7303035 -0.3485353 -0.1404169 -0.0360586 -0.0873617 -0.1545702 0.0583923 0.0605607 0.0902171 0.1015384 0.1578119 0.1607242 0.0308634 0.1652188 -0.0179636 -0.034492 0.0770221 -0.0307572 -0.2905835 -0.0742984 -0.0181381 -0.0892408 0.1072892 0.0441241 0.0449411 -0.097696 -0.0186926 -0.0671316 0.1305298 0.0883299 0.0095036 0.0435729 0.0797401 0.0103606 -0.0750062 -0.0186435 -0.0035764 0.0537342 -0.0921295 -0.0208323 -0.0610765 0.0395489 0.0298227 -0.034793 0.0574626 0.0883794 0.0282292 -0.0419003 -0.0946619 -0.0529715 0.0713073 0.02941 -0.0925606 -0.0169501 -0.0435367 -0.0453366 0.0407504 0.0085473 0.074009 -0.1678802 0.0039123 0.0103609 0.0410241 0.0797222 0.0711548 -0.0273889 0.0540716 -0.0433262 0.1147848 -0.0151589 0.0850672 -0.0185807 0.0179431 0.2801559 -0.0726655 -0.0793802 -0.1789529 0.3301847 0.0192774 -0.1271989 0.0309601 0.0223413 0.0781295 -0.0320504 0.0373262 -0.0287588 0.1241836 -0.0392453 0.0833422 -0.0147686 -0.0138125 -0.0065031 -0.0688238 0.0633966 -0.0855678 0.1136197 0.0095412 0.0371348 -0.0083282 0.0754666 0.3377419 -0.0015455 -0.100247 -0.0032193 0.2682432 0.0993749 -0.2075016 0.0946673 0.1154715 unknown
polarizability: 189.805009|42.0667877|102.072992|18.8718381|19.7698441|120.0850323 unknown
InChI: InChI=1S/C9H10O4S/c10-4-7(12)5-14-9-3-6(11)1-2-8(9)13/h1-3,7,10,12H,4-5H2
charge 0 multiplicity 1
24 atoms
S  -0.818704 -1.400564 0.962602
O  -1.65294 1.171272 -0.804165
O  -4.73503 -0.488965 0.615544
O  0.652253 -1.619048 -1.858636
O  3.433376 1.418287 1.721401
C  -2.663592 0.115998 -0.63459
C  -2.043826 -1.28737 -0.493665
C  -3.626936 0.47327 0.521498
C  0.694407 -0.582865 0.353113
C  1.22112 -0.8343 -1.039379
C  1.455158 0.136677 1.249942
C  2.752296 0.741917 0.880671
C  2.492519 -0.157822 -1.418511
C  3.223291 0.56646 -0.522024
H  -3.220001 0.135408 -1.59179
H  -1.499857 -1.601683 -1.393475
H  -2.825705 -2.020505 -0.230277
H  -3.104543 0.399201 1.491926
H  -3.986465 1.512259 0.383798
H  1.120383 0.310829 2.278897
H  -1.112279 1.229257 0.027195
H  2.810706 -0.31182 -2.455378
H  4.17354 1.045392 -0.782738
H  -5.385171 -0.311883 -0.109961
