program: Gaussian 09
title: 000276270
version: EM64L-G09RevD.01
frameworkgroup: C1[X(C20H13Cl2NO)]
method: RPBEPBE
basis: SDD
operation: Freq
keyword: #p
keyword: freq=noraman
keyword: PBEPBE/SDD
title: #p freq=noraman PBEPBE/SDD
converged: YES YES NO NO
title: Mulliken charges:
elementType: Cl Cl O N C C C C C C C C C C C C C C C C C C C C H H H H H H H H H H H H H
charge: 0.039970 0.000031 -0.231364 -0.413832 0.401987 0.234961 0.218433 0.091795 0.218697 0.331339 -0.744062 0.452083 -0.417502 -0.524286 -0.374294 -0.358530 -0.322365 -0.443515 -0.266022 -0.284448 -0.265948 -0.250337 0.348200 -0.732668 0.295383 0.224858 0.236679 0.228780 0.204933 0.240445 0.243404 0.325961 0.233827 0.235132 0.231268 0.230782 0.360230
chargesum: 0.00000
title: Mulliken charges with hydrogens summed into heavy atoms:
elementType: Cl Cl O N C C C C C C C C C C C C C C C C C C C C
charge: 0.039970 0.000031 -0.231364 -0.087871 0.401987 0.234961 0.218433 0.091795 0.218697 0.331339 -0.448679 0.452083 -0.192644 -0.287608 -0.145515 -0.153597 -0.081920 -0.200112 -0.032195 -0.049316 -0.034681 -0.019555 0.348200 -0.372438
polarizability: 3.94793610e+02 -4.76015256e+01 3.41266149e+02 2.62476620e+00 2.65664252e+00 1.16369681e+02
1716.lowfreq: -8.7877 -0.0018 -0.0012 0.0014 4.8347 6.3153 16.8366 29.6557 46.5654
frequency: 16.6981 29.5840 46.5572 63.2616 65.0679 81.2171 108.3090 117.3721 158.5249 183.5588 203.6149 219.3200 247.0791 248.8269 274.5947 307.8720 340.9203 376.8282 385.4699 420.2512 430.5012 438.2880 482.6697 487.3471 513.2597 553.8556 559.3911 563.2399 565.0234 584.5881 621.0281 625.0695 671.4075 677.6845 685.7024 698.2197 703.8579 741.9616 751.7779 762.8054 767.0579 786.4072 811.3381 822.2594 841.1174 866.7511 884.6349 887.0117 898.2830 934.8709 946.7902 959.5304 960.5845 981.0386 989.7062 995.0945 1015.5217 1040.0664 1050.4897 1069.0406 1112.6992 1158.1107 1165.1688 1180.9297 1182.2430 1191.0667 1200.2362 1223.4746 1238.3686 1251.0479 1257.0096 1272.6793 1282.0547 1308.8015 1367.2458 1388.2971 1403.2519 1408.8432 1415.6684 1438.0939 1448.1933 1455.7097 1475.4736 1516.1093 1530.0780 1550.3879 1575.6434 1604.9597 1609.0575 1615.2625 1627.5944 1627.6699 3115.0410 3123.4665 3127.6322 3136.7546 3138.7780 3153.6640 3156.2862 3164.7724 3164.8975 3167.8699 3176.2267 3207.2202 3505.3237
redmass: 15.9177 6.6433 7.3826 7.5099 7.2706 4.1030 4.6201 11.0967 5.0764 5.2459 6.1673 5.7484 14.0036 7.3377 4.4334 7.6395 3.7910 9.1311 7.8131 3.3369 2.9446 5.8579 3.6170 5.9394 7.0064 2.9564 5.7358 7.1752 3.3673 6.4902 2.5417 6.2324 5.4775 2.2368 4.7402 4.8731 2.7458 8.5286 1.2880 6.0011 1.4439 2.1279 1.7830 5.8534 1.4620 6.2615 4.1598 2.0120 1.9635 6.3939 1.4296 1.8770 1.3758 1.5348 1.3555 1.3575 5.4519 2.2701 2.6796 3.2768 2.4830 1.6788 1.3349 1.1399 1.0810 1.1538 1.5143 1.6264 2.1089 1.6903 1.9258 1.6701 2.5854 1.8482 3.4797 3.9991 3.1710 5.1193 2.5826 3.4660 2.6765 2.3721 2.7321 3.2492 3.7586 2.3576 7.4683 6.3085 7.3463 6.1565 4.6821 6.2219 1.0871 1.0867 1.0881 1.0890 1.0881 1.0945 1.0946 1.0896 1.0966 1.0997 1.0951 1.0904 1.0755
irintensity: 0.0229 0.3204 1.5503 1.5581 0.6399 1.2581 3.3849 3.1235 2.6785 0.2261 1.1305 2.3368 1.0116 0.4037 0.5952 1.0516 0.5954 17.6276 2.5188 0.5459 14.1451 22.5926 0.7481 14.4734 2.9230 0.8325 6.1434 3.7688 20.2826 47.4415 2.5790 13.5524 21.3642 23.5885 22.0623 60.6233 50.6252 18.6712 15.1420 0.0697 165.0853 21.6302 8.2761 16.0895 31.5901 2.6041 6.9166 15.0637 3.8419 2.4643 1.1472 6.3867 12.3231 7.8192 0.0346 0.0330 0.1542 11.2666 6.2996 4.4988 0.5504 0.4569 1.8975 2.2287 11.8824 0.2380 2.1004 13.3398 3.3777 34.7484 1.3620 0.3806 0.5641 4.6968 1.4760 6.4755 8.3101 0.2630 2.0867 15.4543 1.3950 16.4815 101.4443 118.7878 44.3671 221.2075 14.0475 3.7559 61.3909 175.6936 2.0890 10.3233 18.5497 1.5539 5.2837 8.7750 12.6504 32.3112 10.6533 0.8253 18.5491 32.8349 35.0591 2.4952 37.0566
temp: 298.150 k
press: 1.00000 atm
elementType: 17 17 8 7 6 6 6 6 6 6 6 6 6 6 6 6 6 6 6 6 6 6 6 6 1 1 1 1 1 1 1 1 1 1 1 1 1
symmnumber: 1
zpe: 717397.9 jmol-1
zpe.correction: 0.273242 hartree
zpe.thermalcorrener: 0.292625 hartree
zpe.thermalcorrenthalpy: 0.293570 hartree
zpe.thermalcorrgfe: 0.223011 hartree
zpe.sumelectzpe: -1818.446526 hartree
zpe.sumelectthermal: -1818.427143 hartree
zpe.sumelectthermalent: -1818.426199 hartree
zpe.sumelectthermalfe: -1818.496757 hartree
dipole: 1.1861 2.6451 -0.2983
dipole: 2.9141
quadrupole: -137.1186 -136.3478 -160.8899
quadrupole: -3.3848 2.8212 2.4006
quadrupole: 7.6668 8.4376 -16.1045 -3.3848 2.8212 2.4006
hfenergy: -1818.7197688 hartree
pointgroup: C01 [X(C20H13Cl2N1O1)]
dipole: -0.3904093 1.0748862 0.0817505 debye
polarizability: 401.3717248|43.354151|334.2733189|4.6832955|-8.5629088|116.7843964 unknown
InChI: InChI=1S/C20H13Cl2NO/c21-19(22)20(24)23-18-11-17-13-6-2-1-5-12(13)9-10-15(17)14-7-3-4-8-16(14)18/h1-11,19,23H
charge 0 multiplicity 1
37 atoms
Cl 5.055299 -2.193356 -1.39792
Cl 5.454147 -0.77444 1.301575
O  2.134917 -2.737625 0.472684
N  2.593503 -0.427779 0.21641
C  -1.16017 -0.053723 0.035074
C  -1.295994 1.366355 -0.094171
C  -0.096266 2.202769 -0.113922
C  -2.349142 -0.906686 0.061133
C  1.213816 1.603025 -0.003883
C  1.298284 0.154452 0.119599
C  0.149248 -0.630251 0.137399
C  -3.652987 -0.297041 -0.0476
C  -2.618096 1.930914 -0.199341
C  -3.75005 1.133092 -0.177872
C  -0.172888 3.626717 -0.239518
C  2.369883 2.447911 -0.018943
C  -2.285622 -2.330728 0.191832
C  -4.827755 -1.112584 -0.024387
C  0.971022 4.431107 -0.254257
C  2.258033 3.836259 -0.141656
C  -3.448322 -3.111233 0.212647
C  -4.732853 -2.501463 0.103754
C  2.928656 -1.754006 0.368737
C  4.434066 -2.058664 0.36524
H  0.271115 -1.707899 0.235116
H  -2.743636 3.01209 -0.29815
H  -4.745232 1.585779 -0.259941
H  -1.14848 4.111404 -0.32733
H  3.381293 2.033967 0.066587
H  -1.318942 -2.834606 0.279224
H  -5.807626 -0.627896 -0.108975
H  3.3883 0.216859 0.20255
H  0.876582 5.517703 -0.351517
H  3.157246 4.460863 -0.150549
H  -3.369702 -4.199142 0.313531
H  -5.636127 -3.12078 0.120939
H  4.627681 -3.025959 0.841396
