program: Gaussian 09
title: 000276225
version: EM64L-G09RevD.01
frameworkgroup: C1[X(C16H14O2)]
method: RPBEPBE
basis: SDD
operation: Freq
keyword: #pfreq=noraman
keyword: PBEPBE/SDD
title: #p freq=noraman PBEPBE/SDD
converged: YES YES NO NO
title: Mulliken charges:
elementType: O O C C C C C C C C C C C C C C C C H H H H H H H H H H H H H H
charge: -0.469207 -0.260317 0.148885 0.448359 -0.523804 0.215451 -0.340745 0.100773 -0.399950 -0.810511 0.466142 -0.334772 -0.272309 -0.375137 -0.387339 -0.240026 -0.239630 -0.236025 0.289627 0.234901 0.211633 0.223394 0.232828 0.235386 0.292353 0.266167 0.235370 0.237656 0.226784 0.229782 0.231003 0.363276
chargesum: 0.00000
title: Mulliken charges with hydrogens summed into heavy atoms:
elementType: O O C C C C C C C C C C C C C C C C
charge: -0.105931 -0.260317 0.148885 0.448359 -0.234176 0.215451 -0.105844 0.100773 -0.188316 -0.118903 0.466142 -0.042419 -0.006142 -0.139767 -0.149684 -0.013242 -0.009848 -0.005022
polarizability: 3.70946442e+02 -3.24516324e+00 1.88647169e+02 6.32007300e-02 -2.36841621e-02 7.41151510e+01
1716.lowfreq: -9.0489 -2.3248 -0.0008 -0.0004 0.0005 3.2438 11.5776 29.4652 33.0960
frequency: 8.7391 29.2682 33.0604 51.3843 87.9541 104.5148 125.3883 168.7106 181.4730 205.0461 267.7120 275.1580 326.0427 330.8986 367.0217 383.2717 403.1851 434.9002 447.6770 467.3343 494.4010 537.7022 547.6137 570.3512 614.9340 658.8459 673.8936 695.9944 733.1455 748.5696 770.3857 783.3706 801.8302 848.8807 855.0555 911.2353 915.1820 923.2653 935.3065 968.1191 980.8933 987.8737 994.9070 997.2764 1024.7806 1027.6108 1052.7812 1055.9864 1083.8371 1101.4215 1168.2645 1173.3702 1176.0559 1190.2341 1218.3041 1228.0532 1244.5958 1288.1881 1299.7891 1329.4219 1335.5185 1385.7719 1387.6370 1400.1072 1402.4288 1439.8027 1472.7270 1474.2184 1484.2665 1492.4681 1509.9727 1579.7725 1592.6485 1609.3941 1620.4611 1636.1214 2975.5984 3053.1229 3092.1451 3097.9351 3102.2000 3123.5268 3128.4955 3135.5141 3141.1863 3142.1285 3151.4799 3166.1598 3186.7792 3570.8433
redmass: 5.1610 4.2292 1.0267 5.1543 5.8151 4.0514 3.4146 4.5558 3.5297 6.1366 4.9088 3.0649 4.9027 3.1262 1.2324 5.4872 2.7661 3.5219 5.3771 5.1317 2.8713 3.1345 5.1040 5.5220 6.4320 7.1060 4.0418 1.7461 5.8544 2.4035 6.4356 2.4297 1.4757 1.2695 4.8583 1.5732 4.1779 1.3811 1.6596 1.3832 1.3919 5.5260 1.5442 1.3221 2.1958 1.1584 1.5789 2.9311 1.6102 1.8478 1.3232 1.0812 1.6440 1.1300 2.2287 2.8064 1.9958 1.4044 1.8797 1.5947 1.4065 6.3335 5.9657 1.3919 2.7592 2.3037 1.1057 1.1742 2.3131 2.2646 9.1613 5.5920 6.1738 5.9118 6.3743 5.3946 1.0389 1.0962 1.0986 1.0892 1.0879 1.0855 1.0873 1.0955 1.0918 1.0917 1.0964 1.1016 1.0913 1.0657
irintensity: 0.8228 1.6397 0.4949 0.5556 0.3882 0.0339 0.6220 1.8324 2.1078 1.1035 6.2645 1.4555 0.6641 3.0854 124.1006 1.0451 0.1211 0.0160 17.5267 1.4462 20.1877 15.6345 12.8687 33.4189 0.1382 7.9608 1.7107 45.3989 29.7947 25.5257 7.8385 34.3074 52.7922 0.1983 4.4611 10.6223 1.5639 0.1027 0.8530 1.6905 0.0872 5.5646 29.4188 1.9748 4.2572 50.4331 14.9107 14.3768 10.9220 135.5993 47.1798 4.7658 140.7436 21.2599 24.1197 23.8115 23.0070 71.7875 22.7326 62.6326 93.2914 3.9112 30.3028 54.1094 84.4654 40.0006 13.0841 16.6956 36.1478 5.8373 290.3201 18.3399 36.8341 7.5146 135.3298 216.7261 44.8296 23.3119 15.4592 2.0565 13.9755 4.8866 0.1378 20.2579 11.5528 15.5066 38.1953 32.9293 26.9179 34.9129
temp: 298.150 k
press: 1.00000 atm
elementType: 8 8 6 6 6 6 6 6 6 6 6 6 6 6 6 6 6 6 1 1 1 1 1 1 1 1 1 1 1 1 1 1
symmnumber: 1
zpe: 659147.7 jmol-1
zpe.correction: 0.251056 hartree
zpe.thermalcorrener: 0.267472 hartree
zpe.thermalcorrenthalpy: 0.268416 hartree
zpe.thermalcorrgfe: 0.203816 hartree
zpe.sumelectzpe: -767.279370 hartree
zpe.sumelectthermal: -767.262954 hartree
zpe.sumelectthermalent: -767.262010 hartree
zpe.sumelectthermalfe: -767.326610 hartree
dipole: 0.6829 4.3239 0.1640
dipole: 4.3806
quadrupole: -75.3267 -93.1235 -112.1312
quadrupole: 6.2987 0.3039 -0.2146
quadrupole: 18.2005 0.4036 -18.6041 6.2987 0.3039 -0.2146
hfenergy: -767.5304258 hartree
pointgroup: C01 [X(C16H14O2)]
dipole: 0.4554999 -0.1051787 1.6588476 debye
polarizability: 357.0597447|57.4727413|86.4860401|-17.9721793|-12.5987948|190.1629775 unknown
InChI: InChI=1S/C16H14O2/c1-12-7-9-15(17)14(11-12)16(18)10-8-13-5-3-2-4-6-13/h2-11,17H,1H3
charge 0 multiplicity 1
32 atoms
O  1.143164 0.468803 2.034499
O  0.402698 0.67931 -2.230392
C  1.842599 0.777002 -0.308605
C  4.248115 1.258397 -0.783356
C  2.919881 1.048803 -1.201953
C  2.15302 0.7258 1.082973
C  4.514023 1.202293 0.611507
C  0.490247 0.5764 -0.958114
C  3.481466 0.93996 1.528833
C  5.365909 1.512173 -1.77969
C  -3.195953 -0.256098 -0.086525
C  -0.707303 0.260925 -0.140011
C  -1.922969 0.063254 -0.74397
C  -3.331999 -0.395574 1.327344
C  -4.356082 -0.437139 -0.895296
C  -4.579153 -0.703496 1.902813
C  -5.605565 -0.746001 -0.31912
C  -5.722632 -0.880677 1.083786
H  2.655424 1.08703 -2.264854
H  5.533695 1.36635 0.980524
H  3.703289 0.904712 2.604488
H  6.010775 2.351808 -1.461526
H  6.017194 0.622684 -1.88506
H  4.966127 1.749265 -2.779621
H  -0.573576 0.194323 0.94076
H  -1.942879 0.153061 -1.84048
H  -2.457161 -0.261021 1.972558
H  -4.266046 -0.332999 -1.983532
H  -4.667037 -0.806736 2.990234
H  -6.484472 -0.881398 -0.958901
H  -6.691511 -1.120171 1.535939
H  1.529015 0.458362 2.94575
