program: Gaussian 09
title: 000270695
version: EM64L-G09RevD.01
frameworkgroup: C1[X(C14H11BrN2O)]
method: RPBEPBE
basis: SDD
operation: Freq
keyword: #p
keyword: freq=noraman
keyword: PBEPBE/SDD
title: #p freq=noraman PBEPBE/SDD
converged: YES YES NO NO
title: Mulliken charges:
elementType: Br O N N C C C C C C C C C C C C C C H H H H H H H H H H H
charge: -0.032318 -0.284296 -0.483201 -0.660701 -0.818719 0.384493 0.196279 0.341714 0.203461 -0.520678 -0.388736 -0.384857 -0.399050 0.518323 -0.478421 -0.240586 -0.225048 0.265948 0.323142 0.329380 0.241490 0.253481 0.239388 0.215696 0.229325 0.226989 0.292334 0.349538 0.305629
chargesum: 0.00000
title: Mulliken charges with hydrogens summed into heavy atoms:
elementType: Br O N N C C C C C C C C C C C C C C
charge: -0.032318 -0.284296 -0.190866 -0.005534 -0.495578 0.384493 0.196279 0.341714 0.203461 -0.191298 -0.147246 -0.131376 -0.159663 0.518323 -0.262725 -0.011260 0.001941 0.265948
polarizability: 3.18800503e+02 -8.43669513e+00 2.01575429e+02 9.59708306e+00 1.60528376e+01 9.16326931e+01
1716.lowfreq: -2.6691 0.0004 0.0005 0.0007 2.1008 4.0371 33.6124 45.6995 68.0311
frequency: 33.5933 45.6984 68.0292 76.2652 99.7034 117.8442 147.6722 187.0507 220.8072 241.2082 293.1744 295.7416 347.9200 351.3064 414.0408 445.1220 453.3005 479.8898 501.3229 517.3670 555.2900 571.9715 586.0692 593.4124 647.7227 652.3328 658.6085 712.4834 738.2146 745.8509 766.0671 778.2986 792.8522 826.0133 841.7585 882.2318 922.9046 941.6951 947.9256 951.6623 981.2393 987.3278 1000.1384 1026.4833 1043.7234 1095.8771 1119.8062 1128.0818 1149.3644 1168.9073 1179.6242 1201.0531 1224.8672 1270.3558 1282.6577 1308.1871 1313.9012 1373.9169 1388.5006 1443.5374 1454.1390 1463.5574 1494.3356 1514.0509 1590.9338 1594.5023 1613.7526 1618.5424 1629.8273 1661.8890 3085.9722 3110.5790 3125.5813 3135.5790 3146.0533 3147.5226 3164.7192 3183.4119 3530.2543 3542.8479 3696.5868
redmass: 7.9764 4.5624 7.3319 8.0896 4.9272 5.3980 4.0454 6.6877 3.1470 7.2413 1.5113 4.8310 5.1740 4.2340 3.4868 3.1052 4.6869 3.9484 1.1650 4.7323 5.0531 4.1650 1.9490 1.6966 6.2855 5.8096 4.2297 9.6399 5.0579 1.9474 3.5133 2.3736 3.7743 1.6222 4.4451 1.5048 2.7739 1.4637 1.5300 1.4187 3.8582 1.3406 4.5953 2.1110 1.9064 2.1031 1.2128 1.8407 1.3324 1.2230 1.5151 2.1026 1.7029 1.5450 2.1736 2.2541 2.3506 6.5610 3.8486 2.7764 2.7712 4.4289 4.3233 2.3249 4.3982 4.6736 1.5123 7.1494 6.8413 3.6714 1.0875 1.0885 1.0857 1.0894 1.0953 1.0953 1.1003 1.0936 1.0713 1.0504 1.1039
irintensity: 0.8650 19.8302 0.3864 0.6126 0.3063 5.5459 0.9806 3.4161 5.1383 3.9817 20.4678 3.0280 3.7766 1.8537 5.0825 5.5006 7.6177 93.8948 237.9049 0.9361 7.0184 3.4780 65.7419 14.6396 24.8598 13.9233 3.9382 28.5091 5.4183 84.9147 7.3964 21.2185 13.0440 42.6033 15.4501 0.2136 5.6546 5.0824 13.8612 2.3767 2.5945 0.1311 0.1668 4.1833 35.9186 6.2172 28.6038 5.3731 6.6828 3.6806 5.8078 4.4828 5.5180 137.2055 0.5460 46.2797 138.7933 143.1533 95.1988 11.9938 67.5390 203.6589 345.8008 345.4690 93.0437 52.1887 10.9394 22.1037 35.7601 256.4680 2.4023 27.4119 2.7902 1.7271 0.5945 40.7360 36.2820 9.9999 12.0940 77.0910 44.0474
temp: 298.150 k
press: 1.00000 atm
elementType: 35 8 7 7 6 6 6 6 6 6 6 6 6 6 6 6 6 6 1 1 1 1 1 1 1 1 1 1 1
symmnumber: 1
zpe: 572069.8 jmol-1
zpe.correction: 0.217890 hartree
zpe.thermalcorrener: 0.233262 hartree
zpe.thermalcorrenthalpy: 0.234206 hartree
zpe.thermalcorrgfe: 0.173513 hartree
zpe.sumelectzpe: -737.080490 hartree
zpe.sumelectthermal: -737.065118 hartree
zpe.sumelectthermalent: -737.064174 hartree
zpe.sumelectthermalfe: -737.124867 hartree
dipole: -3.1978 -5.4338 -0.5646
dipole: 6.3302
quadrupole: -70.2655 -108.1668 -117.8116
quadrupole: 12.5652 9.5540 6.3291
quadrupole: 28.4824 -9.4188 -19.0636 12.5652 9.5540 6.3291
hfenergy: -737.29838 hartree
pointgroup: C01 [X(C14H11Br1N2O1)]
dipole: 1.074199 -2.2265629 -0.3017517 debye
polarizability: 319.5597297|-2.9792018|202.8029108|4.6038999|8.9701898|89.6459849 unknown
InChI: InChI=1S/C14H11BrN2O/c15-13-11-4-2-1-3-9(11)10-6-5-8(7-12(10)13)17-14(16)18/h1-7,13,17H,16H2
charge 0 multiplicity 1
29 atoms
Br -0.836132 2.865686 1.312947
O  4.102779 1.506222 -0.382193
N  3.577196 -0.76573 0.021496
N  5.807942 -0.044509 -0.069211
C  -1.010168 1.48818 -0.235848
C  0.008642 0.375951 -0.093932
C  -0.67338 -0.870001 0.046919
C  -2.345013 0.776946 -0.182379
C  -2.128446 -0.625569 -0.009352
C  1.406433 0.467998 -0.1141
C  0.075073 -2.056567 0.180831
C  -3.642958 1.300603 -0.293062
C  -3.225173 -1.509753 0.052807
C  2.156935 -0.735355 0.020861
C  1.483346 -1.982641 0.16964
C  -4.744569 0.409942 -0.230573
C  -4.5345 -0.980579 -0.057691
C  4.461307 0.313815 -0.157019
H  -0.861743 2.145716 -1.10591
H  1.928324 1.421659 -0.213571
H  -0.417108 -3.029134 0.287398
H  -3.803754 2.378467 -0.404743
H  -3.075196 -2.587737 0.179829
H  2.072142 -2.903451 0.275125
H  -5.765235 0.799054 -0.312015
H  -5.397215 -1.654584 -0.008869
H  3.987881 -1.691737 0.15502
H  6.482704 0.705562 -0.196919
H  6.145888 -0.977757 0.155812
