program: Gaussian 09
title: 000276207
version: EM64L-G09RevD.01
frameworkgroup: C1[X(C12H10N2)]
method: RPBEPBE
basis: SDD
operation: Freq
keyword: #pfreq=noraman
keyword: PBEPBE/SDD
title: #p freq=noraman PBEPBE/SDD
converged: YES YES NO YES
title: Mulliken charges:
elementType: N N C C C C C C C C C C C C H H H H H H H H H H
charge: -0.267606 -0.553448 0.181626 0.184906 0.233279 0.235273 -0.394181 -0.393299 -0.364990 -0.385679 -0.254063 -0.254264 -0.211780 -0.214878 0.231970 0.234228 0.262514 0.235487 0.221353 0.222679 0.221880 0.222012 0.303505 0.303477
chargesum: 0.00000
title: Mulliken charges with hydrogens summed into heavy atoms:
elementType: N N C C C C C C C C C C C C
charge: -0.267606 0.053534 0.181626 0.184906 0.233279 0.235273 -0.162212 -0.159071 -0.102477 -0.150192 -0.032710 -0.031585 0.010100 0.007134
polarizability: 2.26851887e+02 -5.03303798e-01 1.53954603e+02 -1.22570213e-04 -1.89510214e-02 5.90987273e+01
1716.lowfreq: -0.0008 -0.0006 0.0002 5.5628 7.8263 10.1312 108.1710 126.5466 147.4947
frequency: 108.1672 126.5335 147.4934 207.6326 257.8558 281.9426 305.5487 340.9716 417.7456 426.3384 454.7953 516.5829 521.9460 557.8256 567.8953 579.9233 610.1769 630.3967 716.4912 730.8361 750.8143 758.9476 768.3855 781.1401 856.1480 868.2254 898.9558 935.3898 943.9425 973.0842 977.9949 988.1450 1010.2273 1020.4006 1063.2068 1111.9606 1141.3970 1161.2197 1168.2458 1233.6957 1234.0174 1240.6793 1309.5189 1310.1004 1368.2481 1400.4703 1405.4665 1444.3288 1446.6158 1472.8925 1483.7861 1584.0153 1592.2965 1611.9893 1633.7608 1661.1728 3124.7855 3125.9181 3133.2012 3137.4648 3146.1693 3156.3250 3163.5269 3170.4998 3435.5332 3567.0509
redmass: 4.8074 3.5106 3.4795 4.4984 3.5712 3.1769 5.2447 1.1878 6.4947 3.0355 2.8640 1.5255 4.9251 3.8616 4.4853 3.5219 7.1623 6.2731 5.3070 2.8785 1.4782 1.4893 5.7147 2.5587 1.4308 1.4873 6.9066 1.3946 1.3896 1.3080 1.2986 6.8203 2.1201 1.7960 3.5409 1.4993 1.7197 1.1493 1.0802 2.1758 2.2200 1.1867 1.8433 1.8490 3.2044 5.3240 4.5170 2.9060 3.8226 3.2624 3.6452 6.9149 6.7090 6.3448 4.2573 1.3070 1.0847 1.0851 1.0890 1.0905 1.0950 1.0958 1.1001 1.0980 1.0405 1.1046
irintensity: 4.0693 2.6043 0.9521 0.3222 8.3793 5.1288 0.8079 34.2380 1.1252 8.0085 0.3195 171.4570 1.8834 4.2940 18.8643 0.2310 1.3091 22.6833 1.5053 36.5667 17.9697 152.9439 0.3139 0.6350 0.2439 1.3268 0.4105 3.0051 3.7413 0.0131 0.3247 9.7536 1.5679 8.0544 2.4586 4.5318 3.5361 8.2170 0.6028 25.7644 31.4621 0.0250 28.6346 8.8743 0.6094 1.3255 37.9702 14.7503 44.1496 25.5558 2.9571 4.2534 0.2849 19.1962 3.2244 24.6477 0.5926 0.1081 5.4635 11.6549 28.7663 31.9884 36.2492 16.9015 1.0865 4.9573
temp: 298.150 k
press: 1.00000 atm
elementType: 7 7 6 6 6 6 6 6 6 6 6 6 6 6 1 1 1 1 1 1 1 1 1 1
symmnumber: 1
zpe: 498115.8 jmol-1
zpe.correction: 0.189722 hartree
zpe.thermalcorrener: 0.200213 hartree
zpe.thermalcorrenthalpy: 0.201157 hartree
zpe.thermalcorrgfe: 0.154093 hartree
zpe.sumelectzpe: -571.813730 hartree
zpe.sumelectthermal: -571.803240 hartree
zpe.sumelectthermalent: -571.802295 hartree
zpe.sumelectthermalfe: -571.849360 hartree
dipole: -1.1415 1.8844 -0.0031
dipole: 2.2032
quadrupole: -74.7416 -65.4243 -86.2805
quadrupole: -3.9987 -0.0046 -0.0069
quadrupole: 0.7405 10.0578 -10.7984 -3.9987 -0.0046 -0.0069
hfenergy: -572.0034524 hartree
pointgroup: C01 [X(C12H10N2)]
dipole: 0.4421231 0.7445721 -0.0387321 debye
dipolederiv: -0.7957872 0.1095261 0.0058857 -0.025023 -0.1916222 0.0013059 0.0117538 -0.0004341 -0.1682152 -0.5696901 0.1656641 0.0016663 0.1040418 -0.030558 -0.0001878 0.0045398 -0.0012119 -0.0024638 0.1063161 0.1743408 -0.0097273 -0.3217254 -0.1692706 0.0118488 0.0119818 0.0035172 -0.0234627 0.1990112 -0.1498727 0.0027848 0.3592219 -0.1734015 0.0009449 -0.0195947 0.0092956 -0.0156769 0.4531516 0.4257598 -0.0251719 0.6852585 0.1901719 -0.0167302 -0.0365091 -0.0123984 0.0716458 0.3827523 -0.3757189 0.0111998 -0.7105175 0.0921686 0.010623 0.0258604 0.004893 0.0615442 0.1619286 -0.0636807 -0.0026348 0.1043836 0.0923232 -0.0125746 -0.0099686 -0.0098624 -0.1519043 0.1507613 0.0670171 -0.0077344 -0.0827274 0.0953385 -0.0092462 -0.0010653 -0.0118449 -0.1486043 -0.0886485 -0.1895735 0.0062884 -0.0614425 0.0093232 -0.0080606 0.0007121 -0.0058409 -0.1991477 -0.0452219 0.1893057 -0.0110095 0.0391143 -0.0140229 -0.0096551 -0.0044519 -0.0120369 -0.2214127 -0.181889 0.12198 -0.0055711 0.1687981 -0.0646067 -0.0083608 -0.00744 -0.0075605 -0.1900261 -0.1718864 -0.1225516 0.0051201 -0.1729879 -0.0756921 -0.0020413 0.007144 -0.0028928 -0.1893311 0.0060685 0.0081636 -0.0035863 -0.1235989 0.1425151 -0.0115762 0.002321 -0.0137975 -0.170967 -0.0191475 -0.0212772 -0.0013554 0.1273249 0.1505187 -0.0160078 -0.0080472 -0.0135714 -0.1701713 0.0731228 0.0773837 -0.0020268 0.0244188 -0.091021 0.0102333 0.000277 0.0094554 0.1518403 0.0752522 -0.0727739 0.0043905 -0.0232215 -0.0907696 0.0108585 0.0022385 0.0117807 0.1506601 0.0853191 0.0287994 0.0003202 0.0698341 -0.0420296 0.0082937 -0.0014207 0.0089633 0.1759665 0.0759604 -0.0222672 0.0025383 -0.0815059 -0.0947182 0.013017 0.005028 0.0120229 0.1744627 -0.0502618 -0.1110292 0.0085924 -0.1274991 -0.0310707 0.0108158 0.009338 0.0105432 0.1660984 -0.0510325 0.1089364 -0.0011713 0.1248211 -0.0265141 0.0063466 -0.0019077 0.0065938 0.1672687 -0.1474407 0.0466546 0.0033152 0.049389 0.0772977 0.0027173 0.0031545 0.0027582 0.159322 -0.1428636 -0.047576 0.0069444 -0.0525457 0.0762245 0.0045262 0.0072749 0.0044734 0.1612161 0.249948 -0.1681843 0.1265903 -0.034459 0.0844051 -0.0112874 0.0591617 0.0069524 0.1033149 0.2442771 -0.1790261 -0.1156474 -0.0393524 0.0850109 0.0141969 -0.0603803 0.0002027 0.1080433 unknown
polarizability: 226.7889728|1.0598635|153.7896142|-2.8614058|-4.1358641|59.3266301 unknown
InChI: InChI=1S/C12H10N2/c13-14-11-7-3-1-5-9(11)10-6-2-4-8-12(10)14/h1-8H,13H2
charge 0 multiplicity 1
24 atoms
N  -0.03309 1.465535 -0.102117
N  -0.084299 2.863798 -0.16259
C  -0.751056 -0.727169 0.005645
C  0.710002 -0.721302 -0.019327
C  -1.179759 0.642833 -0.046776
C  1.1239 0.653993 -0.085851
C  -1.726085 -1.750903 0.067036
C  1.696862 -1.73375 0.00832
C  -2.538048 1.011825 -0.03922
C  2.479958 1.03419 -0.124041
C  -3.09207 -1.395068 0.075308
C  3.060163 -1.365939 -0.029534
C  -3.4909 -0.028804 0.022842
C  3.44546 0.002272 -0.094643
H  -1.428351 -2.80473 0.108207
H  1.410798 -2.790335 0.05888
H  -2.827545 2.065677 -0.080049
H  2.77997 2.086502 -0.174353
H  -3.857788 -2.177067 0.122702
H  3.833728 -2.141185 -0.008503
H  -4.558341 0.219794 0.03072
H  4.510046 0.261007 -0.122822
H  0.247164 3.253612 -1.050652
H  0.274081 3.329716 0.677018
